program: Orca
programVersion: 5.0.2
elementType: Br O N N C C C C C C C C C C C C H H H H H H H H H H H H H H H H H H H Cl
charge: 1
multiplicity: 1
keywords: wB97X-D3 TightOpt Freq def2-TZVPP def2/J RIJCOSX TightSCF defgrid3
frequency: 0.00 0.00 0.00 0.00 0.00 0.00 13.24 18.88 30.34 87.25 92.09 126.34 141.52 156.15 177.48 204.53 215.83 223.24 266.63 279.03 286.18 296.41 305.07 318.46 326.46 340.28 342.85 357.17 395.05 427.47 432.09 454.35 461.39 488.06 528.69 546.98 559.13 630.84 694.66 771.62 776.64 796.90 817.84 839.42 901.31 914.06 934.84 950.18 953.06 955.86 968.19 980.60 1009.72 1038.18 1075.90 1079.62 1085.66 1112.05 1139.70 1196.16 1217.71 1230.86 1247.99 1270.49 1290.46 1327.53 1333.25 1363.61 1367.42 1383.49 1403.43 1420.81 1431.36 1431.76 1442.95 1463.97 1469.15 1482.27 1483.41 1490.67 1500.24 1514.40 1522.36 1525.16 1539.55 1625.72 1642.99 1657.54 1684.62 3059.37 3064.34 3066.40 3070.41 3131.90 3133.89 3146.19 3149.70 3162.33 3163.11 3168.36 3201.27 3203.20 3209.87 3418.91 3471.91 3643.99 3761.98 3900.71
frequency: 13.24 18.88 30.34 87.25 92.09 126.34 141.52 156.15 177.48 204.53 215.83 223.24 266.63 279.03 286.18 296.41 305.07 318.46 326.46 340.28 342.85 357.17 395.05 427.47 432.09 454.35 461.39 488.06 528.69 546.98 559.13 630.84 694.66 771.62 776.64 796.90 817.84 839.42 901.31 914.06 934.84 950.18 953.06 955.86 968.19 980.60 1009.72 1038.18 1075.90 1079.62 1085.66 1112.05 1139.70 1196.16 1217.71 1230.86 1247.99 1270.49 1290.46 1327.53 1333.25 1363.61 1367.42 1383.49 1403.43 1420.81 1431.36 1431.76 1442.95 1463.97 1469.15 1482.27 1483.41 1490.67 1500.24 1514.40 1522.36 1525.16 1539.55 1625.72 1642.99 1657.54 1684.62 3059.37 3064.34 3066.40 3070.41 3131.90 3133.89 3146.19 3149.70 3162.33 3163.11 3168.36 3201.27 3203.20 3209.87 3418.91 3471.91 3643.99 3761.98 3900.71
formula: C12H19BrClN2O
InChI: InChI=1S/C12H19BrClN2O/c1-12(2,3)16-6-10(17)7-4-8(13)11(15)9(14)5-7/h4-5,10,17H,6,15-16H2,1-3H3
36 atoms
Br -2.354014 -2.371206 0.040987
O  1.759435 -0.030277 2.6309
N  2.638341 -0.143863 0.097608
N  -3.548226 0.291093 -0.986914
C  3.72459 -0.336086 -0.954813
C  2.509167 1.16614 0.792344
C  1.369606 1.046347 1.803047
C  3.551261 -1.769075 -1.447036
C  3.486641 0.664317 -2.077039
C  5.0812 -0.142343 -0.292174
C  0.03611 0.828479 1.116557
C  -0.49369 -0.442304 0.936692
C  -0.659929 1.915993 0.59883
C  -1.841121 1.732653 -0.084415
C  -1.680377 -0.622113 0.248423
C  -2.400616 0.454849 -0.290968
H  2.755213 -0.845098 0.833151
H  3.447487 1.37303 1.300561
H  2.302112 1.93757 0.055924
H  1.342323 1.984556 2.365875
H  4.293712 -1.982196 -2.213734
H  3.693543 -2.491856 -0.641311
H  2.56588 -1.927016 -1.890208
H  3.651707 1.692567 -1.757234
H  2.478852 0.578558 -2.488567
H  4.187684 0.460494 -2.884672
H  5.860793 -0.393946 -1.00938
H  5.247832 0.888136 0.019107
H  5.206829 -0.797594 0.571894
H  -0.001079 -1.308932 1.359552
H  -0.293566 2.926438 0.736319
H  1.138146 -0.1390 3.352412
H  -4.00406 -0.602391 -0.983859
H  -4.097902 1.096929 -1.220112
H  1.731471 -0.351174 -0.3300
Cl -2.68213 3.10808 -0.70193
totalener: -3687.74380720 hartree
nucrepener: 1783.44635634 hartree
electener: -5471.19016354 hartree
oneelecener: -8630.81655605 hartree
twoeener: 3159.62639251 hartree
kineticenergy: 3680.43086654 hartree
xcener: -155.820353179445 hartree
chargesum: 1.0000000
charge: -0.001771 -0.338264 0.114444 -0.239382 0.006080 -0.147519 0.146301 -0.240016 -0.268629 -0.264453 -0.011443 -0.247787 -0.166547 0.001843 -0.091903 0.161403 0.177453 0.148113 0.144837 0.144260 0.116547 0.111061 0.111149 0.108207 0.117240 0.122371 0.119861 0.109135 0.118594 0.147510 0.119822 0.198978 0.168229 0.162031 0.183504 -0.041260
charge: 0.402605 0.302681 0.541008 0.362235 -0.188282 0.023972 -0.169997 0.034717 0.035858 0.036557 -0.125117 -0.061873 -0.030109 -0.383665 -0.351563 -0.199534 0.043953 0.035842 0.035929 0.039628 0.037787 0.024811 0.024603 0.021692 0.025791 0.039296 0.039114 0.021627 0.026347 0.021378 0.032377 -0.112189 -0.041805 -0.040592 0.045054 0.449864
qa: -0.0018 -0.3383 0.1144 -0.2394 0.0061 -0.1475 0.1463 -0.2400 -0.2686 -0.2645 -0.0114 -0.2478 -0.1665 0.0018 -0.0919 0.1614 0.1775 0.1481 0.1448 0.1443 0.1165 0.1111 0.1111 0.1082 0.1172 0.1224 0.1199 0.1091 0.1186 0.1475 0.1198 0.1990 0.1682 0.1620 0.1835 -0.0413
va: 1.2719 2.0908 3.6174 3.2597 4.0197 3.8444 3.9432 3.8930 3.9033 3.9100 3.5598 3.8733 4.0968 4.0435 4.1393 3.8806 1.0263 1.0125 0.9988 0.9829 1.0086 1.0059 1.0060 1.0053 1.0028 1.0079 1.0078 1.0047 1.0031 1.0305 1.0241 1.0390 1.0376 1.0452 1.0064 1.2861
dispcorr: -0.018380312 hartree
energy: -3687.762289841597
dipole: 66.06670 -62.10011 3.96659 20.29742 -19.87234 0.42508 -4.09521 4.01190 -0.08331
magnitude: 3.99017 au
magnitude: 10.14221 debye
temp: 298.15 k
press: 1.00 atm
zeropoint: 0.30621919 hartree
thermalvibcorrection: 0.01609706 hartree
thermalrotcorrection: 0.00141627 hartree
thermaltrasncorrection: 0.00141627 hartree
thermaltotal: -3687.43714105 hartree
thermalcorr: 0.01892960 hartree
nonthermalcorr: 0.30621919 hartree
totalcorr: 0.32514879 hartree
thermalcorrenthalpy: 0.00094421 hartree
totalenthalpy: -3687.43619684 hartree
totalentropycorr: -0.06571843 hartree
gibbsenthalpy: -3687.50191527 hartree
gibbsminuselec: 0.26037457 hartree
