program: Orca
programVersion: 5.0.2
elementType: Br O N N C C C C C C C C C C C C H H H H H H H H H H H H H H H H H H H Cl
charge: 1
multiplicity: 1
keywords: wB97X-D3 TightOpt Freq def2-TZVPP def2/J RIJCOSX TightSCF defgrid3
frequency: 0.00 0.00 0.00 0.00 0.00 0.00 12.96 20.14 33.23 86.63 92.46 130.33 146.90 148.24 175.63 205.44 220.46 226.01 270.11 276.35 281.86 292.06 306.40 313.92 339.64 343.49 346.13 360.42 392.31 426.66 432.05 456.67 468.12 488.28 528.68 539.61 559.99 628.37 697.08 769.56 773.44 790.33 824.13 837.95 901.31 915.48 935.15 951.47 953.22 955.81 966.45 980.86 1011.18 1037.92 1076.43 1079.52 1084.35 1111.27 1139.59 1196.23 1217.30 1230.98 1249.22 1267.75 1289.95 1326.72 1333.94 1358.65 1368.20 1383.07 1402.80 1419.05 1431.30 1431.46 1442.55 1463.60 1469.41 1481.80 1483.72 1490.34 1500.21 1514.60 1522.36 1525.32 1539.00 1625.60 1642.64 1655.25 1684.20 3059.22 3064.39 3066.15 3070.00 3131.02 3133.77 3145.98 3149.23 3162.20 3162.99 3168.24 3200.41 3200.95 3211.41 3405.86 3479.72 3642.65 3760.50 3901.06
frequency: 12.96 20.14 33.23 86.63 92.46 130.33 146.90 148.24 175.63 205.44 220.46 226.01 270.11 276.35 281.86 292.06 306.40 313.92 339.64 343.49 346.13 360.42 392.31 426.66 432.05 456.67 468.12 488.28 528.68 539.61 559.99 628.37 697.08 769.56 773.44 790.33 824.13 837.95 901.31 915.48 935.15 951.47 953.22 955.81 966.45 980.86 1011.18 1037.92 1076.43 1079.52 1084.35 1111.27 1139.59 1196.23 1217.30 1230.98 1249.22 1267.75 1289.95 1326.72 1333.94 1358.65 1368.20 1383.07 1402.80 1419.05 1431.30 1431.46 1442.55 1463.60 1469.41 1481.80 1483.72 1490.34 1500.21 1514.60 1522.36 1525.32 1539.00 1625.60 1642.64 1655.25 1684.20 3059.22 3064.39 3066.15 3070.00 3131.02 3133.77 3145.98 3149.23 3162.20 3162.99 3168.24 3200.41 3200.95 3211.41 3405.86 3479.72 3642.65 3760.50 3901.06
formula: C12H19BrClN2O
InChI: InChI=1S/C12H19BrClN2O/c1-12(2,3)16-6-10(17)7-4-8(13)11(15)9(14)5-7/h4-5,10,17H,6,15-16H2,1-3H3
36 atoms
Br 3.2500 -1.761188 -0.431342
O  -2.032523 0.48892 2.67385
N  -2.831727 -0.05782 0.153624
N  3.139366 1.259532 -1.065378
C  -3.785249 -0.393482 -0.987243
C  -2.348831 -1.140999 1.053354
C  -1.321418 -0.532005 2.005813
C  -4.097723 0.944076 -1.649952
C  -3.063544 -1.32595 -1.950535
C  -5.0391 -1.028381 -0.403615
C  -0.107367 -0.028276 1.250243
C  0.873892 -0.925544 0.842971
C  0.024563 1.306358 0.888172
C  1.102702 1.725599 0.131883
C  1.946646 -0.503217 0.087367
C  2.104677 0.841392 -0.301536
H  -3.258218 0.650869 0.753742
H  -3.200923 -1.528456 1.606031
H  -1.903609 -1.926685 0.449493
H  -1.020581 -1.322343 2.700533
H  -4.771017 0.785024 -2.490119
H  -4.590355 1.631091 -0.959137
H  -3.195586 1.42232 -2.036938
H  -2.872544 -2.306681 -1.516562
H  -2.117674 -0.900259 -2.29211
H  -3.689505 -1.478161 -2.828173
H  -5.764862 -1.171609 -1.202521
H  -4.841821 -2.005821 0.035162
H  -5.502923 -0.389125 0.350039
H  0.814194 -1.970061 1.125165
H  -0.697041 2.044452 1.215462
H  -1.494672 0.872144 3.368246
H  3.91423 0.642409 -1.224099
H  3.293846 2.243591 -1.182264
H  -2.001549 0.391707 -0.245221
Cl 1.231895 3.395938 -0.291962
totalener: -3687.74374204 hartree
nucrepener: 1772.55399951 hartree
electener: -5460.29774155 hartree
oneelecener: -8609.10744705 hartree
twoeener: 3148.80970549 hartree
kineticenergy: 3680.43169554 hartree
xcener: -155.820473051857 hartree
chargesum: 1.0000000
charge: 0.006148 -0.337912 0.113549 -0.240421 0.008113 -0.151420 0.151972 -0.241110 -0.266699 -0.264688 -0.021329 -0.139088 -0.264475 0.008086 -0.109007 0.167033 0.176479 0.147730 0.144847 0.143149 0.116916 0.109954 0.112450 0.107141 0.117876 0.122977 0.120149 0.110715 0.117080 0.123949 0.144810 0.199227 0.168671 0.161817 0.181020 -0.045709
charge: 0.412164 0.301766 0.541457 0.361681 -0.188253 0.023522 -0.170554 0.034726 0.036136 0.036332 -0.124891 -0.034313 -0.058156 -0.392358 -0.343272 -0.199808 0.046237 0.035907 0.035609 0.039458 0.037795 0.024562 0.024829 0.020986 0.025974 0.039218 0.039130 0.022409 0.026232 0.031872 0.022798 -0.112452 -0.042166 -0.040179 0.043820 0.441780
qa: 0.0061 -0.3379 0.1135 -0.2404 0.0081 -0.1514 0.1520 -0.2411 -0.2667 -0.2647 -0.0213 -0.1391 -0.2645 0.0081 -0.1090 0.1670 0.1765 0.1477 0.1448 0.1431 0.1169 0.1100 0.1125 0.1071 0.1179 0.1230 0.1201 0.1107 0.1171 0.1239 0.1448 0.1992 0.1687 0.1618 0.1810 -0.0457
va: 1.2748 2.0942 3.6209 3.2592 4.0149 3.8484 3.9486 3.8939 3.9045 3.9078 3.5658 3.9763 3.9846 4.0608 4.1327 3.8612 1.0226 1.0129 0.9982 0.9820 1.0085 1.0066 1.0052 1.0074 1.0036 1.0075 1.0084 1.0027 1.0026 1.0159 1.0385 1.0393 1.0389 1.0439 1.0151 1.2852
dispcorr: -0.018536340 hartree
energy: -3687.762173590482
dipole: -73.61136 69.50659 -4.10477 8.04522 -8.30006 -0.25484 0.49870 -0.40051 0.09819
magnitude: 4.11384 au
magnitude: 10.45656 debye
temp: 298.15 k
press: 1.00 atm
zeropoint: 0.30619711 hartree
thermalvibcorrection: 0.01606724 hartree
thermalrotcorrection: 0.00141627 hartree
thermaltrasncorrection: 0.00141627 hartree
thermaltotal: -3687.43707669 hartree
thermalcorr: 0.01889978 hartree
nonthermalcorr: 0.30619711 hartree
totalcorr: 0.32509690 hartree
thermalcorrenthalpy: 0.00094421 hartree
totalenthalpy: -3687.43613248 hartree
totalentropycorr: -0.06561150 hartree
gibbsenthalpy: -3687.50174398 hartree
gibbsminuselec: 0.26042961 hartree
