program: Orca
programVersion: 5.0.2
elementType: S F O O O N N N C C C C C C C C C C C C C C C H H H H H H H H H H H H H H H H H H H
charge: 1
multiplicity: 1
keywords: wB97X-D3 TightOpt Freq def2-TZVPP def2/J RIJCOSX TightSCF defgrid3
frequency: 0.00 0.00 0.00 0.00 0.00 0.00 16.35 19.40 46.65 52.64 68.21 77.09 80.87 103.90 120.28 148.26 162.39 172.63 206.05 207.54 209.16 229.02 236.23 247.09 276.89 308.38 320.36 334.32 363.03 373.47 425.29 435.16 438.73 445.00 465.11 467.57 513.30 538.48 556.88 576.38 588.63 603.03 611.37 622.40 626.73 670.57 718.35 752.17 759.39 783.85 789.91 838.09 848.31 861.10 882.33 896.11 928.93 946.01 946.83 956.21 959.71 983.22 1000.72 1002.66 1039.10 1060.21 1081.71 1101.57 1119.57 1133.76 1159.15 1164.96 1193.29 1205.01 1214.29 1235.17 1246.14 1274.97 1299.47 1311.84 1315.05 1340.92 1356.80 1369.52 1380.48 1407.79 1416.58 1421.67 1429.31 1439.35 1444.53 1461.17 1479.53 1490.03 1493.48 1497.25 1500.09 1505.27 1513.91 1518.56 1544.30 1585.36 1613.80 1668.00 1693.82 1748.28 1873.37 3014.80 3057.27 3060.79 3067.23 3079.85 3106.00 3115.58 3131.57 3138.24 3149.91 3155.10 3164.41 3176.43 3229.43 3243.72 3244.26 3625.62 3675.54 3854.61
frequency: 16.35 19.40 46.65 52.64 68.21 77.09 80.87 103.90 120.28 148.26 162.39 172.63 206.05 207.54 209.16 229.02 236.23 247.09 276.89 308.38 320.36 334.32 363.03 373.47 425.29 435.16 438.73 445.00 465.11 467.57 513.30 538.48 556.88 576.38 588.63 603.03 611.37 622.40 626.73 670.57 718.35 752.17 759.39 783.85 789.91 838.09 848.31 861.10 882.33 896.11 928.93 946.01 946.83 956.21 959.71 983.22 1000.72 1002.66 1039.10 1060.21 1081.71 1101.57 1119.57 1133.76 1159.15 1164.96 1193.29 1205.01 1214.29 1235.17 1246.14 1274.97 1299.47 1311.84 1315.05 1340.92 1356.80 1369.52 1380.48 1407.79 1416.58 1421.67 1429.31 1439.35 1444.53 1461.17 1479.53 1490.03 1493.48 1497.25 1500.09 1505.27 1513.91 1518.56 1544.30 1585.36 1613.80 1668.00 1693.82 1748.28 1873.37 3014.80 3057.27 3060.79 3067.23 3079.85 3106.00 3115.58 3131.57 3138.24 3149.91 3155.10 3164.41 3176.43 3229.43 3243.72 3244.26 3625.62 3675.54 3854.61
formula: C15H19FN3O3S
InChI: InChI=1S/C15H19FN3O3S/c1-7(2)12(19-15(21)22)13(20)17-8(3)14-18-10-5-4-9(16)6-11(10)23-14/h4-8,12,17-19,21H,1-3H3
42 atoms
S  2.506263 -1.888633 -0.855261
F  6.748238 0.914809 -0.114527
O  -0.977428 0.774887 0.994555
O  -4.17414 -1.589851 -0.965954
O  -5.369151 -1.698889 0.939299
N  -1.258269 -0.828662 -0.585336
N  -3.979447 0.057972 0.558452
N  1.438388 -0.024361 0.438839
C  -3.166346 2.307761 -0.084404
C  -3.040951 0.794155 -0.266472
C  -0.230562 -1.766233 -0.141776
C  -1.651254 0.269174 0.101778
C  -4.589898 2.771767 -0.380136
C  -2.168207 3.027673 -0.988304
C  1.149358 -1.153857 -0.152989
C  -0.534273 -2.38579 1.226709
C  3.526665 -0.594517 -0.316795
C  2.770161 0.349863 0.374744
C  -4.580989 -1.118247 0.246306
C  4.895054 -0.430976 -0.502842
C  3.353225 1.497194 0.90664
C  5.447337 0.709009 0.03289
C  4.704915 1.668582 0.728989
H  -2.919579 2.537945 0.956455
H  -3.248661 0.551876 -1.310148
H  -0.220494 -2.561057 -0.887678
H  -5.326515 2.309509 0.275456
H  -4.868881 2.540993 -1.410914
H  -4.664806 3.851019 -0.25176
H  -1.136805 2.746578 -0.773992
H  -2.246257 4.105497 -0.851998
H  -2.372762 2.815999 -2.040676
H  -1.944057 -1.212077 -1.217963
H  -4.215691 0.421322 1.465901
H  -0.580247 -1.623429 2.002003
H  0.229043 -3.115321 1.495278
H  -1.495697 -2.895024 1.180735
H  5.509828 -1.143642 -1.033748
H  2.761893 2.226542 1.443265
H  5.216164 2.537391 1.119686
H  -4.710989 -2.370336 -1.136321
H  0.63845 0.497325 0.866012
totalener: -1470.98160435 hartree
nucrepener: 2131.83846963 hartree
electener: -3602.82007398 hartree
oneelecener: -6227.93778073 hartree
twoeener: 2625.11770675 hartree
kineticenergy: 1465.86453766 hartree
xcener: -119.767598647818 hartree
chargesum: 1.0000000
charge: 0.194224 -0.158800 -0.446552 -0.322797 -0.343230 -0.202729 -0.226533 -0.076746 0.048151 0.034030 0.063457 0.281102 -0.245498 -0.281993 0.128755 -0.226998 -0.066292 0.155837 0.411242 -0.123393 -0.173983 0.259964 -0.090698 0.056714 0.115943 0.091634 0.092633 0.084797 0.102128 0.082174 0.103935 0.091434 0.178606 0.169285 0.115515 0.111616 0.115510 0.146800 0.154592 0.154055 0.216055 0.226059
charge: 0.879629 0.240994 0.138852 0.325787 0.094832 0.341934 0.335825 0.426714 -0.097685 -0.115282 -0.136548 -0.339820 0.023038 0.021114 -0.309705 0.045062 -0.289759 -0.148019 -0.557455 0.000957 0.030300 -0.211911 0.034013 0.031431 0.040237 0.047169 0.012984 0.020023 0.022907 0.008406 0.024217 0.018679 -0.015788 -0.003512 0.023905 0.026959 0.030300 0.039339 0.039028 0.043538 -0.087999 -0.054693
qa: 0.1942 -0.1588 -0.4466 -0.3228 -0.3432 -0.2027 -0.2265 -0.0767 0.0482 0.0340 0.0635 0.2811 -0.2455 -0.2820 0.1288 -0.2270 -0.0663 0.1558 0.4112 -0.1234 -0.1740 0.2600 -0.0907 0.0567 0.1159 0.0916 0.0926 0.0848 0.1021 0.0822 0.1039 0.0914 0.1786 0.1693 0.1155 0.1116 0.1155 0.1468 0.1546 0.1541 0.2161 0.2261
va: 2.7778 1.1483 2.0633 2.0920 2.1666 3.1888 3.1183 3.5214 3.8539 3.8726 4.0149 4.0846 3.9535 3.9522 3.9375 3.9057 3.9377 3.8188 4.3996 3.8880 4.0063 4.0669 3.9343 1.0267 1.0232 1.0080 1.0155 1.0036 1.0075 1.0131 1.0076 1.0064 1.0344 1.0281 1.0126 1.0102 1.0097 1.0037 1.0050 1.0001 1.0332 1.0672
dispcorr: -0.021864526 hartree
energy: -1471.003481735151
dipole: -32.10135 33.69339 1.59204 11.16798 -11.69963 -0.53165 -0.00435 -0.78634 -0.79070
magnitude: 1.85538 au
magnitude: 4.71600 debye
temp: 298.15 k
press: 1.00 atm
zeropoint: 0.34048944 hartree
thermalvibcorrection: 0.01943335 hartree
thermalrotcorrection: 0.00141627 hartree
thermaltrasncorrection: 0.00141627 hartree
thermaltotal: -1470.64072640 hartree
thermalcorr: 0.02226589 hartree
nonthermalcorr: 0.34048944 hartree
totalcorr: 0.36275533 hartree
thermalcorrenthalpy: 0.00094421 hartree
totalenthalpy: -1470.63978220 hartree
totalentropycorr: -0.07210912 hartree
gibbsenthalpy: -1470.71189132 hartree
gibbsminuselec: 0.29159042 hartree
