program: Orca
programVersion: 5.0.2
elementType: Cl S P O O O O O N N C C C C C C C C C H H H H H H H H H H H
charge: 1
multiplicity: 1
keywords: wB97X-D3 TightOpt Freq def2-TZVPP def2/J RIJCOSX TightSCF defgrid3
frequency: 0.00 0.00 0.00 0.00 0.00 0.00 25.89 36.84 52.04 71.29 74.68 83.42 88.23 105.49 125.42 132.57 154.64 168.80 202.41 213.93 245.44 266.46 289.39 312.41 351.43 370.33 395.16 415.42 424.35 440.83 455.36 475.33 584.68 611.66 617.82 640.26 672.33 723.89 742.26 764.07 782.89 788.63 795.00 877.37 894.06 914.51 963.36 980.17 1036.73 1095.08 1102.29 1105.18 1116.82 1119.15 1154.22 1183.40 1188.65 1205.56 1208.84 1236.30 1246.33 1303.46 1326.19 1354.23 1384.63 1406.33 1466.39 1488.99 1490.42 1490.97 1500.67 1502.51 1503.96 1508.44 1557.24 1635.43 1720.92 1754.76 1960.90 2648.52 3078.65 3084.50 3114.69 3165.54 3175.45 3180.84 3204.15 3209.79 3243.70 3264.80
frequency: 25.89 36.84 52.04 71.29 74.68 83.42 88.23 105.49 125.42 132.57 154.64 168.80 202.41 213.93 245.44 266.46 289.39 312.41 351.43 370.33 395.16 415.42 424.35 440.83 455.36 475.33 584.68 611.66 617.82 640.26 672.33 723.89 742.26 764.07 782.89 788.63 795.00 877.37 894.06 914.51 963.36 980.17 1036.73 1095.08 1102.29 1105.18 1116.82 1119.15 1154.22 1183.40 1188.65 1205.56 1208.84 1236.30 1246.33 1303.46 1326.19 1354.23 1384.63 1406.33 1466.39 1488.99 1490.42 1490.97 1500.67 1502.51 1503.96 1508.44 1557.24 1635.43 1720.92 1754.76 1960.90 2648.52 3078.65 3084.50 3114.69 3165.54 3175.45 3180.84 3204.15 3209.79 3243.70 3264.80
formula: C9H11ClN2O5PS
InChI: InChI=1S/C9H11ClN2O5PS/c1-15-18(14,16-2)19-5-12-8-7(17-9(12)13)3-6(10)4-11-8/h3-4,11H,5H2,1-2H3
30 atoms
Cl 4.648309 -2.417718 -0.012118
S  -1.868412 1.101336 0.885974
P  -2.478974 -0.63415 -0.07979
O  2.673472 2.332373 0.264634
O  -3.213094 -1.327736 1.10721
O  -3.523648 -0.269969 -1.186143
O  1.031319 3.902634 0.198399
O  -1.365568 -1.37382 -0.712277
N  0.58776 1.657765 -0.207628
N  1.123281 -0.71364 -0.40624
C  1.390238 0.562062 -0.201715
C  -0.833157 1.778646 -0.453461
C  2.685527 0.990845 0.085378
C  1.381049 2.781518 0.100115
C  3.724431 0.115028 0.1545
C  3.41155 -1.23956 -0.076679
C  2.124229 -1.62618 -0.347228
C  -3.687658 -2.691487 1.026546
C  -4.77153 0.391214 -0.906969
H  -1.035386 2.845728 -0.510795
H  -1.08935 1.321816 -1.40764
H  4.734903 0.430679 0.375282
H  1.844232 -2.653932 -0.521168
H  -4.123831 -2.912288 1.994628
H  -2.85276 -3.35853 0.823987
H  -4.440719 -2.780171 0.245166
H  -5.364712 -0.198495 -0.210302
H  -5.286527 0.475027 -1.858063
H  -4.585676 1.38134 -0.492231
H  0.119828 -1.033496 -0.570451
totalener: -2034.96539170 hartree
nucrepener: 1970.10891229 hartree
electener: -4005.07430399 hartree
oneelecener: -6694.52967977 hartree
twoeener: 2689.45537578 hartree
kineticenergy: 2029.62871601 hartree
xcener: -133.691704988528 hartree
chargesum: 1.0000000
charge: 0.031865 -0.086482 0.799866 -0.196599 -0.312607 -0.283847 -0.238477 -0.522896 -0.087404 -0.120461 0.206366 -0.122456 0.153594 0.357713 -0.073838 0.067419 0.016904 -0.130791 -0.117162 0.165787 0.159704 0.167314 0.156397 0.141433 0.130719 0.122908 0.122504 0.142347 0.114851 0.235331
charge: 0.501143 0.466468 0.025910 0.376567 0.104449 0.115043 0.189939 -0.144461 0.274580 0.437994 -0.157536 -0.251561 -0.174681 -0.456465 0.056593 -0.406602 -0.016099 -0.019060 -0.035969 0.027796 0.014312 0.053387 0.040077 0.020370 0.011146 0.009454 0.007056 0.020061 0.003415 -0.093325
qa: 0.0319 -0.0865 0.7999 -0.1966 -0.3126 -0.2838 -0.2385 -0.5229 -0.0874 -0.1205 0.2064 -0.1225 0.1536 0.3577 -0.0738 0.0674 0.0169 -0.1308 -0.1172 0.1658 0.1597 0.1673 0.1564 0.1414 0.1307 0.1229 0.1225 0.1423 0.1149 0.2353
va: 1.3226 2.2720 5.5243 2.2750 2.1599 2.1617 2.2648 2.0879 3.2677 3.4726 4.0262 3.9052 3.9999 4.3473 3.9818 4.0622 3.9759 3.8404 3.8366 1.0193 0.9982 0.9998 1.0080 0.9856 0.9926 0.9864 0.9882 0.9883 0.9944 1.0793
dispcorr: -0.014777005 hartree
energy: -2034.980215197293
dipole: -25.35590 24.47074 -0.88516 -2.28855 1.10865 -1.17990 -1.99774 1.72096 -0.27677
magnitude: 1.50076 au
magnitude: 3.81462 debye
temp: 298.15 k
press: 1.00 atm
zeropoint: 0.21655377 hartree
thermalvibcorrection: 0.01615587 hartree
thermalrotcorrection: 0.00141627 hartree
thermaltrasncorrection: 0.00141627 hartree
thermaltotal: -2034.74467302 hartree
thermalcorr: 0.01898842 hartree
nonthermalcorr: 0.21655377 hartree
totalcorr: 0.23554218 hartree
thermalcorrenthalpy: 0.00094421 hartree
totalenthalpy: -2034.74372881 hartree
totalentropycorr: -0.06624848 hartree
gibbsenthalpy: -2034.80997728 hartree
gibbsminuselec: 0.17023792 hartree
