program: Orca
programVersion: 5.0.2
elementType: S P O O O N N C C C C C H H H H H H H H H H H H H H H H
charge: 1
multiplicity: 1
keywords: wB97X-D3 TightOpt Freq def2-TZVPP def2/J RIJCOSX TightSCF defgrid3
frequency: 0.00 0.00 0.00 0.00 0.00 0.00 37.69 63.59 68.50 95.29 137.46 155.81 169.84 218.87 238.01 266.59 272.14 306.15 330.27 340.37 352.74 368.15 383.89 412.44 419.66 457.65 495.24 522.19 586.22 684.11 801.14 848.49 863.49 868.88 891.87 906.79 965.33 977.08 989.47 992.69 998.27 1028.70 1056.02 1070.34 1095.79 1154.82 1166.01 1189.53 1243.09 1271.67 1285.27 1296.27 1308.60 1338.56 1347.33 1381.39 1398.10 1431.38 1438.48 1473.93 1486.81 1512.35 1516.65 1527.47 1538.55 1560.42 1627.24 1699.85 2908.63 3019.74 3036.84 3064.57 3087.35 3092.81 3103.22 3105.82 3134.91 3160.45 3162.87 3361.32 3536.22 3576.16 3864.26 3881.74
frequency: 37.69 63.59 68.50 95.29 137.46 155.81 169.84 218.87 238.01 266.59 272.14 306.15 330.27 340.37 352.74 368.15 383.89 412.44 419.66 457.65 495.24 522.19 586.22 684.11 801.14 848.49 863.49 868.88 891.87 906.79 965.33 977.08 989.47 992.69 998.27 1028.70 1056.02 1070.34 1095.79 1154.82 1166.01 1189.53 1243.09 1271.67 1285.27 1296.27 1308.60 1338.56 1347.33 1381.39 1398.10 1431.38 1438.48 1473.93 1486.81 1512.35 1516.65 1527.47 1538.55 1560.42 1627.24 1699.85 2908.63 3019.74 3036.84 3064.57 3087.35 3092.81 3103.22 3105.82 3134.91 3160.45 3162.87 3361.32 3536.22 3576.16 3864.26 3881.74
formula: C5H16N2O3PS
InChI: InChI=1S/C5H16N2O3PS/c6-2-1-3-7-4-5-12-11(8,9)10/h7-9H,1-5H2,6H3
28 atoms
S  1.43433 0.932717 -1.076151
P  1.791044 -0.610918 0.247611
O  2.660134 0.059473 1.388564
O  2.727724 -1.560672 -0.591868
O  0.626542 -1.34958 0.762124
N  -1.446476 0.924142 0.267568
N  -1.58942 -1.526821 -0.827549
C  -2.901276 0.856743 0.400659
C  -3.316045 -0.585351 0.689242
C  -0.887526 2.210045 -0.112702
C  0.630673 2.190506 -0.023878
C  -3.036096 -1.5500 -0.456709
H  -3.278943 1.516449 1.189455
H  -3.347522 1.19865 -0.537846
H  -4.386076 -0.622903 0.894268
H  -2.818112 -0.935071 1.598551
H  -1.247366 3.026058 0.52762
H  -1.202867 2.439826 -1.13298
H  0.971628 2.052572 1.00223
H  1.034434 3.142266 -0.364537
H  -3.594382 -1.259976 -1.34671
H  -3.312536 -2.570293 -0.198508
H  -1.280773 -0.519371 -0.778531
H  -1.406606 -1.943632 -1.734033
H  2.613838 -0.403265 2.231064
H  3.596165 -1.214794 -0.815405
H  -1.020308 0.608435 1.132074
H  -0.963567 -1.95567 -0.132645
totalener: -1274.90421498 hartree
nucrepener: 1087.89828990 hartree
electener: -2362.80250488 hartree
oneelecener: -3899.64592071 hartree
twoeener: 1536.84341583 hartree
kineticenergy: 1271.22651815 hartree
xcener: -86.425936193500 hartree
chargesum: 1.0000000
charge: -0.126251 0.788944 -0.317561 -0.300827 -0.574513 -0.293215 0.001269 -0.096547 -0.142441 -0.074587 -0.114119 -0.099488 0.114175 0.109689 0.107743 0.094019 0.108405 0.108289 0.110751 0.140451 0.129140 0.140917 0.190482 0.179670 0.231491 0.226404 0.132065 0.225646
charge: 0.436059 0.018732 0.177797 0.194576 -0.251687 0.264177 0.582629 -0.065687 -0.021868 -0.108527 -0.233638 0.009317 0.020707 0.027013 0.041559 0.030478 0.023649 0.024408 0.006486 0.020372 0.030289 0.029617 -0.029751 0.030715 -0.109833 -0.111206 -0.045510 0.009129
qa: -0.1263 0.7889 -0.3176 -0.3008 -0.5745 -0.2932 0.0013 -0.0965 -0.1424 -0.0746 -0.1141 -0.0995 0.1142 0.1097 0.1077 0.0940 0.1084 0.1083 0.1108 0.1405 0.1291 0.1409 0.1905 0.1797 0.2315 0.2264 0.1321 0.2256
va: 2.3044 5.5720 2.2096 2.2434 2.0076 2.9974 3.5837 3.8950 3.8976 3.8999 3.8832 3.8523 1.0044 0.9974 1.0181 1.0177 1.0000 1.0001 1.0335 1.0110 1.0003 1.0039 1.0975 0.9998 1.0269 1.0267 1.0294 1.0219
dispcorr: -0.013167006 hartree
energy: -1274.917403666752
dipole: -21.38693 19.63243 -1.75450 3.07115 -3.42114 -0.34999 1.41532 -1.60728 -0.19196
magnitude: 1.79933 au
magnitude: 4.57355 debye
temp: 298.15 k
press: 1.00 atm
zeropoint: 0.24154942 hartree
thermalvibcorrection: 0.01172190 hartree
thermalrotcorrection: 0.00141627 hartree
thermaltrasncorrection: 0.00141627 hartree
thermaltotal: -1274.66129981 hartree
thermalcorr: 0.01455444 hartree
nonthermalcorr: 0.24154942 hartree
totalcorr: 0.25610386 hartree
thermalcorrenthalpy: 0.00094421 hartree
totalenthalpy: -1274.66035560 hartree
totalentropycorr: -0.05536963 hartree
gibbsenthalpy: -1274.71572523 hartree
gibbsminuselec: 0.20167844 hartree
