program: Orca
programVersion: 5.0.2
elementType: S P O O O N N C C C C C H H H H H H H H H H H H H H H H
charge: 1
multiplicity: 1
keywords: wB97X-D3 TightOpt Freq def2-TZVPP def2/J RIJCOSX TightSCF defgrid3
frequency: 0.00 0.00 0.00 0.00 0.00 0.00 22.01 52.14 63.90 78.85 116.96 140.80 173.14 219.23 231.78 258.04 271.07 300.78 314.26 347.53 364.21 367.32 400.33 408.16 419.92 442.26 490.37 537.41 581.76 682.31 794.01 831.38 863.37 876.96 889.01 902.80 958.42 959.19 973.25 1002.32 1007.71 1027.82 1047.84 1065.60 1090.74 1124.88 1165.81 1176.63 1245.06 1281.17 1291.83 1306.14 1322.45 1341.87 1356.26 1388.93 1408.68 1424.76 1431.47 1468.73 1488.23 1500.48 1509.00 1517.70 1519.53 1546.05 1663.21 1701.27 2804.12 3021.83 3047.76 3065.34 3091.59 3104.65 3107.19 3112.56 3133.78 3157.17 3165.39 3509.97 3576.54 3578.93 3874.00 3879.83
frequency: 22.01 52.14 63.90 78.85 116.96 140.80 173.14 219.23 231.78 258.04 271.07 300.78 314.26 347.53 364.21 367.32 400.33 408.16 419.92 442.26 490.37 537.41 581.76 682.31 794.01 831.38 863.37 876.96 889.01 902.80 958.42 959.19 973.25 1002.32 1007.71 1027.82 1047.84 1065.60 1090.74 1124.88 1165.81 1176.63 1245.06 1281.17 1291.83 1306.14 1322.45 1341.87 1356.26 1388.93 1408.68 1424.76 1431.47 1468.73 1488.23 1500.48 1509.00 1517.70 1519.53 1546.05 1663.21 1701.27 2804.12 3021.83 3047.76 3065.34 3091.59 3104.65 3107.19 3112.56 3133.78 3157.17 3165.39 3509.97 3576.54 3578.93 3874.00 3879.83
formula: C5H16N2O3PS
InChI: InChI=1S/C5H16N2O3PS/c6-2-1-3-7-4-5-12-11(8,9)10/h7-9H,1-5H2,6H3
28 atoms
S  1.290685 0.862309 -1.19049
P  1.926156 -0.514348 0.228202
O  2.421385 0.303276 1.488914
O  3.214731 -1.055883 -0.50921
O  0.955849 -1.540532 0.623174
N  -1.490959 0.804444 0.701326
N  -1.488952 -1.623404 -0.52773
C  -2.947077 0.62627 0.830052
C  -3.522863 -0.269949 -0.267768
C  -1.102376 1.944398 -0.122814
C  0.404581 2.114339 -0.202024
C  -2.952694 -1.681392 -0.243347
H  -3.142505 0.167401 1.800885
H  -3.466669 1.589823 0.82572
H  -3.365902 0.177132 -1.253956
H  -4.603178 -0.336922 -0.137005
H  -1.525892 2.878127 0.269027
H  -1.511887 1.810918 -1.126871
H  0.851159 2.164595 0.79068
H  0.632365 3.055273 -0.700882
H  -3.432344 -2.334377 -0.969404
H  -3.066633 -2.128987 0.743499
H  -1.286939 -1.552009 -1.520592
H  -0.937124 -2.388677 -0.145959
H  3.241609 0.789181 1.365695
H  3.378488 -1.992897 -0.367187
H  -1.078779 0.898355 1.620013
H  -1.130201 -0.745015 -0.056505
totalener: -1274.90011827 hartree
nucrepener: 1085.20049058 hartree
electener: -2360.10060884 hartree
oneelecener: -3894.29420840 hartree
twoeener: 1534.19359956 hartree
kineticenergy: 1271.22667292 hartree
xcener: -86.422609194988 hartree
chargesum: 1.0000000
charge: -0.133019 0.797080 -0.306110 -0.318992 -0.567112 -0.262282 0.032822 -0.087969 -0.155527 -0.090497 -0.125562 -0.086757 0.112798 0.108629 0.088786 0.110312 0.111169 0.104195 0.109263 0.143926 0.137197 0.125423 0.179621 0.207471 0.225655 0.229866 0.140825 0.168787
charge: 0.426303 0.022282 0.188503 0.180148 -0.265237 0.278570 0.581645 -0.056655 -0.025877 -0.110595 -0.243283 0.011157 0.027808 0.022965 0.024767 0.041855 0.023716 0.021049 0.004362 0.020159 0.027986 0.033088 0.034378 0.031097 -0.113259 -0.109685 -0.040871 -0.036375
qa: -0.1330 0.7971 -0.3061 -0.3190 -0.5671 -0.2623 0.0328 -0.0880 -0.1555 -0.0905 -0.1256 -0.0868 0.1128 0.1086 0.0888 0.1103 0.1112 0.1042 0.1093 0.1439 0.1372 0.1254 0.1796 0.2075 0.2257 0.2299 0.1408 0.1688
va: 2.2796 5.5696 2.2161 2.2291 2.0283 3.0406 3.5934 3.8985 3.8714 3.9184 3.9006 3.8512 1.0038 1.0059 1.0152 1.0214 1.0041 0.9917 1.0329 1.0058 1.0045 1.0012 1.0047 1.0044 1.0271 1.0303 1.0172 1.1376
dispcorr: -0.013316944 hartree
energy: -1274.913534613923
dipole: -22.34300 20.41829 -1.92471 2.42261 -2.85757 -0.43496 1.05006 -1.28025 -0.23020
magnitude: 1.98663 au
magnitude: 5.04962 debye
temp: 298.15 k
press: 1.00 atm
zeropoint: 0.24145324 hartree
thermalvibcorrection: 0.01191764 hartree
thermalrotcorrection: 0.00141627 hartree
thermaltrasncorrection: 0.00141627 hartree
thermaltotal: -1274.65733118 hartree
thermalcorr: 0.01475018 hartree
nonthermalcorr: 0.24145324 hartree
totalcorr: 0.25620343 hartree
thermalcorrenthalpy: 0.00094421 hartree
totalenthalpy: -1274.65638698 hartree
totalentropycorr: -0.05600345 hartree
gibbsenthalpy: -1274.71239042 hartree
gibbsminuselec: 0.20114419 hartree
