program: Orca
programVersion: 5.0.2
elementType: S P O O O N N C C C C C H H H H H H H H H H H H H H H H
charge: 1
multiplicity: 1
keywords: wB97X-D3 TightOpt Freq def2-TZVPP def2/J RIJCOSX TightSCF defgrid3
frequency: 0.00 0.00 0.00 0.00 0.00 0.00 21.52 47.39 54.02 79.18 133.79 136.89 149.51 182.78 212.74 234.86 266.45 293.21 327.97 343.60 367.41 383.07 407.19 425.37 431.39 442.85 504.92 532.25 587.82 690.06 790.86 842.61 870.09 876.70 889.88 949.28 959.81 969.02 989.72 999.70 1012.13 1028.82 1035.25 1064.69 1102.98 1124.74 1127.75 1200.22 1240.27 1270.00 1286.99 1305.38 1327.30 1353.26 1363.91 1393.94 1405.06 1427.74 1437.19 1477.45 1490.57 1503.94 1511.73 1520.03 1537.07 1566.12 1666.59 1675.21 2991.07 3065.23 3066.45 3094.87 3096.85 3105.52 3114.53 3129.03 3137.66 3149.24 3152.00 3164.00 3555.25 3629.42 3875.11 3882.44
frequency: 21.52 47.39 54.02 79.18 133.79 136.89 149.51 182.78 212.74 234.86 266.45 293.21 327.97 343.60 367.41 383.07 407.19 425.37 431.39 442.85 504.92 532.25 587.82 690.06 790.86 842.61 870.09 876.70 889.88 949.28 959.81 969.02 989.72 999.70 1012.13 1028.82 1035.25 1064.69 1102.98 1124.74 1127.75 1200.22 1240.27 1270.00 1286.99 1305.38 1327.30 1353.26 1363.91 1393.94 1405.06 1427.74 1437.19 1477.45 1490.57 1503.94 1511.73 1520.03 1537.07 1566.12 1666.59 1675.21 2991.07 3065.23 3066.45 3094.87 3096.85 3105.52 3114.53 3129.03 3137.66 3149.24 3152.00 3164.00 3555.25 3629.42 3875.11 3882.44
formula: C5H16N2O3PS
InChI: InChI=1S/C5H16N2O3PS/c6-2-1-3-7-4-5-12-11(8,9)10/h8-9H,1-7H2
28 atoms
S  -1.372494 0.458904 1.377171
P  -2.145322 -0.447069 -0.320384
O  -3.333075 0.439895 -0.856968
O  -2.76987 -1.742914 0.318533
O  -1.150777 -0.633101 -1.387796
N  1.211141 0.383104 -0.48532
N  2.685116 -1.254633 1.174953
C  2.436678 0.397853 -1.338808
C  3.703561 0.242271 -0.509425
C  0.919218 1.649103 0.237218
C  -0.564564 1.851131 0.514703
C  3.788711 -1.101562 0.210031
H  2.334225 -0.434064 -2.036321
H  2.437382 1.320226 -1.918203
H  3.795535 1.062701 0.208432
H  4.554758 0.338906 -1.18446
H  1.278482 2.481667 -0.36847
H  1.486804 1.639271 1.166901
H  1.399592 -0.358753 0.230428
H  -1.109467 2.072663 -0.402257
H  -0.678076 2.716265 1.165603
H  4.768901 -1.204956 0.680839
H  3.703605 -1.906124 -0.522973
H  2.911987 -0.802192 2.051326
H  2.529246 -2.229096 1.39309
H  -4.084713 0.54238 -0.26676
H  -2.818918 -2.506335 -0.264384
H  0.381469 0.072292 -1.027887
totalener: -1274.90540222 hartree
nucrepener: 1068.17977670 hartree
electener: -2343.08517893 hartree
oneelecener: -3859.84517685 hartree
twoeener: 1516.75999792 hartree
kineticenergy: 1271.22980902 hartree
xcener: -86.424388755024 hartree
chargesum: 1.0000000
charge: -0.118028 0.789391 -0.284363 -0.315202 -0.521941 0.001932 -0.343381 -0.110560 -0.142632 -0.120408 -0.121893 -0.067845 0.133414 0.123509 0.089585 0.108684 0.127313 0.121414 0.197924 0.128361 0.137083 0.119171 0.102373 0.146968 0.155898 0.222935 0.233144 0.207156
charge: 0.437573 0.037101 0.197483 0.187224 -0.203817 0.509632 0.297057 0.007273 -0.028261 -0.035345 -0.235893 -0.062817 0.035318 0.028739 0.024776 0.041242 0.034071 0.026311 -0.034227 0.013175 0.022625 0.017546 0.024816 -0.044526 -0.040991 -0.111495 -0.104691 -0.039897
qa: -0.1180 0.7894 -0.2844 -0.3152 -0.5219 0.0019 -0.3434 -0.1106 -0.1426 -0.1204 -0.1219 -0.0678 0.1334 0.1235 0.0896 0.1087 0.1273 0.1214 0.1979 0.1284 0.1371 0.1192 0.1024 0.1470 0.1559 0.2229 0.2331 0.2072
va: 2.2700 5.5623 2.2426 2.2426 2.0790 3.4710 3.0633 3.8760 3.8536 3.9019 3.9278 3.8939 1.0015 1.0051 1.0118 1.0202 1.0007 0.9993 1.0859 1.0183 1.0110 1.0014 1.0025 1.0198 1.0204 1.0286 1.0305 1.0701
dispcorr: -0.012366115 hartree
energy: -1274.917828697477
dipole: 25.01149 -23.27032 1.74117 3.18082 -2.92287 0.25795 -0.89253 1.28186 0.38933
magnitude: 1.80271 au
magnitude: 4.58213 debye
temp: 298.15 k
press: 1.00 atm
zeropoint: 0.24161989 hartree
thermalvibcorrection: 0.01200349 hartree
thermalrotcorrection: 0.00141627 hartree
thermaltrasncorrection: 0.00141627 hartree
thermaltotal: -1274.66137278 hartree
thermalcorr: 0.01483603 hartree
nonthermalcorr: 0.24161989 hartree
totalcorr: 0.25645592 hartree
thermalcorrenthalpy: 0.00094421 hartree
totalenthalpy: -1274.66042857 hartree
totalentropycorr: -0.05641744 hartree
gibbsenthalpy: -1274.71684601 hartree
gibbsminuselec: 0.20098269 hartree
