program: Orca
programVersion: 5.0.2
elementType: C C C C C C C H H H N O N H H Cl H
charge: 1
multiplicity: 1
keywords: wB97X-D3 TightOpt Freq def2-TZVPP def2/J RIJCOSX TightSCF defgrid3 CHELPG
frequency: 0.00 0.00 0.00 0.00 0.00 0.00 93.52 133.07 186.06 204.09 293.50 315.46 361.86 372.54 439.01 496.71 567.45 616.74 672.14 689.31 732.54 777.68 854.03 856.64 927.62 944.88 1007.44 1008.66 1077.01 1101.05 1115.78 1146.49 1199.45 1257.40 1292.82 1335.60 1407.67 1481.58 1515.18 1529.39 1638.23 1641.73 1675.59 1685.79 1739.81 3234.67 3249.88 3250.95 3412.06 3483.75 3497.96
frequency: 93.52 133.07 186.06 204.09 293.50 315.46 361.86 372.54 439.01 496.71 567.45 616.74 672.14 689.31 732.54 777.68 854.03 856.64 927.62 944.88 1007.44 1008.66 1077.01 1101.05 1115.78 1146.49 1199.45 1257.40 1292.82 1335.60 1407.67 1481.58 1515.18 1529.39 1638.23 1641.73 1675.59 1685.79 1739.81 3234.67 3249.88 3250.95 3412.06 3483.75 3497.96
formula: C7H6ClN2O
InChI: InChI=1S/C7H6ClN2O/c8-4-1-2-6-5(3-4)10-7(9)11-6/h1-3H,9H3
17 atoms
C  -0.709417 0.821148 0.000059
C  -0.444742 -0.541623 -0.000037
C  0.859936 -1.011913 -0.00008
C  1.851112 -0.048071 -0.000017
C  1.563118 1.325859 0.000082
C  0.263126 1.796278 0.00012
C  -2.503257 -0.285159 -0.000011
H  1.089753 -2.067373 -0.000155
H  2.385651 2.027442 0.000128
H  0.036283 2.852363 0.000195
N  -1.667874 -1.233215 -0.000076
O  -2.092221 0.975904 0.000073
N  -3.943679 -0.481608 0.000006
H  -4.115702 -1.490961 -0.000355
H  -4.383047 -0.071203 0.828916
Cl 3.498531 -0.540408 -0.00006
H  -4.383149 -0.070574 -0.828539
totalener: -915.06071487 hartree
nucrepener: 651.91889861 hartree
electener: -1566.97961348 hartree
oneelecener: -2532.40566210 hartree
twoeener: 965.42604862 hartree
kineticenergy: 912.13938092 hartree
xcener: -64.226474227502 hartree
chargesum: 1.0000000
charge: 0.139350 0.111255 -0.170534 0.092141 -0.066782 -0.135502 0.291338 0.151510 0.143247 0.156992 -0.251924 -0.237229 0.098975 0.234862 0.223545 -0.004786 0.223543
charge: -0.146054 -0.158367 0.009442 -0.383728 0.007763 0.020665 -0.378111 0.039383 0.037956 0.038652 0.199529 0.376471 0.626103 0.088707 0.078764 0.464061 0.078763
qa: 0.1394 0.1113 -0.1705 0.0921 -0.0668 -0.1355 0.2913 0.1515 0.1432 0.1570 -0.2519 -0.2372 0.0990 0.2349 0.2235 -0.0048 0.2235
va: 3.7715 3.8498 4.0966 4.0427 3.9721 4.0181 4.0929 1.0117 1.0078 0.9990 3.0692 2.2990 3.7235 0.9829 0.9768 1.2938 0.9768
dispcorr: -0.005208902 hartree
energy: -915.067675385502
dipole: -13.88118 7.90092 -5.98026 1.87969 -1.81152 0.06817 0.00027 -0.00020 0.00007
magnitude: 5.98064 au
magnitude: 15.20159 debye
temp: 298.15 k
press: 1.00 atm
zeropoint: 0.12876386 hartree
thermalvibcorrection: 0.00580344 hartree
thermalrotcorrection: 0.00141627 hartree
thermaltrasncorrection: 0.00141627 hartree
thermaltotal: -914.93027554 hartree
thermalcorr: 0.00863598 hartree
nonthermalcorr: 0.12876386 hartree
totalcorr: 0.13739984 hartree
thermalcorrenthalpy: 0.00094421 hartree
totalenthalpy: -914.92933133 hartree
totalentropycorr: -0.04367172 hartree
gibbsenthalpy: -914.97300305 hartree
gibbsminuselec: 0.09467234 hartree
