program: Orca
programVersion: 5.0.2
elementType: C C C C C C H H H H C H H H S O O N C N H H O H C C C H H C H H C H H C H H H H H H N
charge: 1
multiplicity: 1
keywords: wB97X-D3 TightOpt Freq def2-TZVPP def2/J RIJCOSX TightSCF defgrid3 CHELPG
frequency: 0.00 0.00 0.00 0.00 0.00 0.00 16.01 22.52 30.09 41.98 44.49 56.42 88.32 100.81 106.61 139.90 173.35 206.27 219.24 260.51 280.67 294.62 317.01 330.43 352.50 353.95 363.48 415.34 429.19 458.68 482.02 499.35 503.65 528.78 543.74 557.57 570.05 609.53 648.32 651.65 693.97 700.53 730.46 758.92 762.18 768.29 810.00 819.31 833.98 850.30 860.21 873.15 874.07 900.07 956.14 979.81 992.74 1004.07 1019.52 1029.95 1041.41 1042.74 1057.49 1066.31 1073.23 1106.45 1121.55 1139.61 1157.71 1162.12 1197.77 1201.69 1227.30 1232.87 1254.91 1255.72 1275.62 1300.65 1319.08 1339.57 1340.11 1347.36 1357.10 1365.27 1375.87 1399.86 1405.86 1413.62 1419.31 1423.96 1426.28 1443.93 1454.79 1478.65 1485.87 1489.83 1492.78 1495.30 1495.76 1496.94 1510.16 1517.96 1548.90 1638.14 1650.05 1676.78 1731.43 3042.45 3051.18 3055.65 3070.25 3073.15 3074.11 3079.63 3103.29 3106.01 3114.72 3121.88 3124.41 3132.49 3141.28 3166.91 3210.62 3213.11 3228.07 3234.40 3350.16 3533.46 3570.59
frequency: 16.01 22.52 30.09 41.98 44.49 56.42 88.32 100.81 106.61 139.90 173.35 206.27 219.24 260.51 280.67 294.62 317.01 330.43 352.50 353.95 363.48 415.34 429.19 458.68 482.02 499.35 503.65 528.78 543.74 557.57 570.05 609.53 648.32 651.65 693.97 700.53 730.46 758.92 762.18 768.29 810.00 819.31 833.98 850.30 860.21 873.15 874.07 900.07 956.14 979.81 992.74 1004.07 1019.52 1029.95 1041.41 1042.74 1057.49 1066.31 1073.23 1106.45 1121.55 1139.61 1157.71 1162.12 1197.77 1201.69 1227.30 1232.87 1254.91 1255.72 1275.62 1300.65 1319.08 1339.57 1340.11 1347.36 1357.10 1365.27 1375.87 1399.86 1405.86 1413.62 1419.31 1423.96 1426.28 1443.93 1454.79 1478.65 1485.87 1489.83 1492.78 1495.30 1495.76 1496.94 1510.16 1517.96 1548.90 1638.14 1650.05 1676.78 1731.43 3042.45 3051.18 3055.65 3070.25 3073.15 3074.11 3079.63 3103.29 3106.01 3114.72 3121.88 3124.41 3132.49 3141.28 3166.91 3210.62 3213.11 3228.07 3234.40 3350.16 3533.46 3570.59
formula: C14H22N3O3S
InChI: InChI=1S/C14H22N3O3S/c1-12-6-8-13(9-7-12)21(19,20)16-14(18)15-17-10-4-2-3-5-11-17/h6-9,15-16,18H,2-5,10-11H2,1H3
43 atoms
C  4.392283 -1.765724 -0.082032
C  4.02332 -1.323961 1.187636
C  3.162721 -0.255269 1.351293
C  2.661799 0.377905 0.219828
C  3.013891 -0.037314 -1.060954
C  3.873954 -1.10707 -1.199026
H  4.424139 -1.818903 2.062994
H  2.896529 0.096642 2.3388
H  2.640039 0.481122 -1.933959
H  4.160402 -1.432767 -2.190956
C  5.357657 -2.900504 -0.246878
H  6.378066 -2.515316 -0.299989
H  5.309575 -3.590148 0.593987
H  5.167912 -3.45503 -1.164427
S  1.579006 1.717994 0.419486
O  1.621708 2.204349 1.745141
O  1.654114 2.590747 -0.718854
N  0.025656 1.027229 0.255976
C  -0.819072 1.175011 -0.768941
N  -1.985255 0.561316 -0.734339
H  -0.341873 0.454547 1.010693
H  -2.620863 0.710266 -1.508391
O  -0.561375 1.89381 -1.808693
H  0.300521 2.36036 -1.681366
C  -3.438402 0.356098 1.122725
C  -2.424566 -1.645467 -0.001659
C  -4.749816 0.525803 0.3564
H  -3.57133 -0.279793 1.999157
H  -3.094545 1.325935 1.486057
C  -3.678807 -2.077064 -0.757934
H  -2.361359 -2.201407 0.935845
H  -1.527065 -1.88675 -0.573611
C  -5.648426 -0.71263 0.244372
H  -4.534329 0.921402 -0.641335
H  -5.314326 1.322976 0.842245
C  -4.942114 -2.065181 0.103751
H  -3.81592 -1.480669 -1.666789
H  -3.493339 -3.094963 -1.106188
H  -6.314715 -0.563566 -0.607348
H  -6.297523 -0.760698 1.120401
H  -5.659745 -2.778888 -0.302039
H  -4.680528 -2.450573 1.093817
N  -2.315751 -0.22573 0.363597
totalener: -1334.71508377 hartree
nucrepener: 1916.64684835 hartree
electener: -3251.36193212 hartree
oneelecener: -5610.08440705 hartree
twoeener: 2358.72247493 hartree
kineticenergy: 1328.91691012 hartree
xcener: -109.016956501575 hartree
chargesum: 1.0000000
charge: 0.011495 -0.121647 -0.079080 -0.065139 -0.108042 -0.133952 0.138351 0.156810 0.132737 0.137603 -0.171683 0.118612 0.096795 0.096226 0.841193 -0.375279 -0.437232 -0.199776 0.475295 -0.107367 0.196574 0.179056 -0.242177 0.258341 -0.082193 -0.097454 -0.179310 0.112098 0.108452 -0.154056 0.114591 0.100495 -0.160863 0.077834 0.107779 -0.132249 0.074053 0.103518 0.092659 0.096728 0.103297 0.077603 -0.160695
charge: -0.043316 0.022629 0.003499 -0.266782 -0.005252 0.021655 0.035329 0.033989 0.028026 0.034850 0.041490 0.035483 0.026965 0.026688 0.725067 -0.182081 -0.171002 0.189258 -0.356481 0.323333 -0.025502 -0.005541 0.438237 -0.136064 -0.065965 -0.081038 -0.032131 0.034882 0.024238 -0.027048 0.031507 0.022713 -0.024818 0.011953 0.033572 -0.026956 0.017646 0.033687 0.026274 0.027484 0.028737 0.021074 0.149712
qa: 0.0115 -0.1216 -0.0791 -0.0651 -0.1080 -0.1340 0.1384 0.1568 0.1327 0.1376 -0.1717 0.1186 0.0968 0.0962 0.8412 -0.3753 -0.4372 -0.1998 0.4753 -0.1074 0.1966 0.1791 -0.2422 0.2583 -0.0822 -0.0975 -0.1793 0.1121 0.1085 -0.1541 0.1146 0.1005 -0.1609 0.0778 0.1078 -0.1322 0.0741 0.1035 0.0927 0.0967 0.1033 0.0776 -0.1607
va: 3.8127 3.9842 3.9966 3.7866 4.0257 4.0059 1.0042 1.0094 1.0163 1.0043 3.8957 0.9953 1.0048 1.0041 5.8476 2.1480 2.0540 3.2715 4.2432 3.4188 1.0414 1.0265 2.3064 1.0714 3.8988 3.9223 3.7998 1.0039 1.0087 3.8279 0.9993 1.0139 3.8693 1.0125 1.0169 3.8369 1.0140 1.0177 1.0115 1.0105 1.0089 1.0134 2.7830
dispcorr: -0.020562051 hartree
energy: -1334.742857680346
dipole: -22.39108 21.46995 -0.92113 -20.81185 19.32074 -1.49111 -0.51966 -0.02514 -0.54481
magnitude: 1.83540 au
magnitude: 4.66522 debye
temp: 298.15 k
press: 1.00 atm
zeropoint: 0.36716809 hartree
thermalvibcorrection: 0.01753578 hartree
thermalrotcorrection: 0.00141627 hartree
thermaltrasncorrection: 0.00141627 hartree
thermaltotal: -1334.35532128 hartree
thermalcorr: 0.02036832 hartree
nonthermalcorr: 0.36716809 hartree
totalcorr: 0.38753641 hartree
thermalcorrenthalpy: 0.00094421 hartree
totalenthalpy: -1334.35437707 hartree
totalentropycorr: -0.06853139 hartree
gibbsenthalpy: -1334.42290846 hartree
gibbsminuselec: 0.31994922 hartree
