program: Orca
programVersion: 5.0.2
elementType: C C C C C C H H H H N H C C C C C H C H H C O O H C H H H Cl H
charge: 1
multiplicity: 1
keywords: wB97X-D3 TightOpt Freq def2-TZVPP def2/J RIJCOSX TightSCF defgrid3 CHELPG
frequency: 0.00 0.00 0.00 0.00 0.00 0.00 23.75 29.32 53.28 92.00 112.18 121.62 136.56 169.29 211.16 235.43 276.74 286.33 304.34 397.20 413.38 432.59 450.67 474.99 492.24 511.55 527.73 542.13 571.25 621.74 629.03 662.69 683.48 725.56 739.98 769.51 795.19 815.55 822.43 834.62 855.20 889.70 926.67 955.53 980.39 1024.68 1033.36 1045.33 1055.81 1061.26 1083.29 1113.33 1120.44 1178.10 1191.09 1199.99 1202.89 1219.53 1228.99 1253.07 1258.39 1306.56 1323.23 1337.34 1368.18 1432.33 1436.15 1474.20 1478.25 1498.93 1514.28 1520.61 1530.09 1555.70 1656.60 1659.07 1668.17 1694.06 1701.85 1775.47 2952.33 3070.06 3139.31 3150.31 3212.08 3218.26 3227.54 3230.47 3237.58 3242.61 3248.32 3507.69 3810.01
frequency: 23.75 29.32 53.28 92.00 112.18 121.62 136.56 169.29 211.16 235.43 276.74 286.33 304.34 397.20 413.38 432.59 450.67 474.99 492.24 511.55 527.73 542.13 571.25 621.74 629.03 662.69 683.48 725.56 739.98 769.51 795.19 815.55 822.43 834.62 855.20 889.70 926.67 955.53 980.39 1024.68 1033.36 1045.33 1055.81 1061.26 1083.29 1113.33 1120.44 1178.10 1191.09 1199.99 1202.89 1219.53 1228.99 1253.07 1258.39 1306.56 1323.23 1337.34 1368.18 1432.33 1436.15 1474.20 1478.25 1498.93 1514.28 1520.61 1530.09 1555.70 1656.60 1659.07 1668.17 1694.06 1701.85 1775.47 2952.33 3070.06 3139.31 3150.31 3212.08 3218.26 3227.54 3230.47 3237.58 3242.61 3248.32 3507.69 3810.01
formula: C14H13ClNO2
InChI: InChI=1S/C14H13ClNO2/c1-9-11(15)6-4-8-12(9)16-13-7-3-2-5-10(13)14(17)18/h2-8,17H,16H2,1H3
31 atoms
C  1.939126 2.637207 0.798596
C  1.006843 1.807596 0.192687
C  1.399323 0.557658 -0.232411
C  2.706836 0.098632 -0.060391
C  3.624958 0.946176 0.55309
C  3.244209 2.20768 0.97693
H  1.638328 3.620599 1.133963
H  -0.018259 2.131846 0.069103
H  4.640478 0.605851 0.69643
H  3.968375 2.855404 1.451576
N  0.411924 -0.316407 -0.896476
H  0.190142 0.064435 -1.814289
C  -0.836789 -0.549334 -0.151636
C  -2.010923 0.066701 -0.567924
C  -0.753911 -1.397067 0.938568
C  -3.14681 -0.234615 0.193588
C  -1.897809 -1.657785 1.666252
H  0.191248 -1.850667 1.209555
C  -3.097325 -1.075603 1.291902
H  -1.860233 -2.318902 2.520743
H  -4.003444 -1.273508 1.847347
C  3.10325 -1.265784 -0.500856
O  2.327299 -2.065004 -0.995955
O  4.373246 -1.54523 -0.302781
H  4.55103 -2.443644 -0.609352
C  -2.111115 0.987392 -1.751475
H  -2.687976 0.524855 -2.553094
H  -2.632787 1.902617 -1.474455
H  -1.148966 1.292395 -2.164686
Cl -4.662881 0.456265 -0.245072
H  0.920083 -1.221749 -1.058978
totalener: -1206.58510765 hartree
nucrepener: 1374.61798075 hartree
electener: -2581.20308840 hartree
oneelecener: -4359.97179856 hartree
twoeener: 1778.76871016 hartree
kineticenergy: 1202.10946716 hartree
xcener: -93.227202589140 hartree
chargesum: 1.0000000
charge: -0.058203 -0.136851 0.001240 -0.120451 -0.057363 -0.103050 0.159861 0.156501 0.159626 0.160352 0.116372 0.190194 0.198581 -0.152946 -0.189460 0.091373 -0.074984 0.132101 -0.132292 0.153227 0.143608 0.443387 -0.366482 -0.216639 0.226813 -0.275504 0.148933 0.128968 0.064509 -0.007374 0.215950
charge: 0.044872 0.019606 -0.062821 -0.078182 0.054853 0.032295 0.040195 0.039205 0.041096 0.039186 0.552725 0.039769 -0.093403 -0.098897 0.005087 -0.366239 0.020622 0.032957 -0.001339 0.036991 0.037261 -0.396558 0.152786 0.422500 -0.062624 0.018630 0.038227 0.034265 0.008098 0.473360 -0.024520
qa: -0.0582 -0.1369 0.0012 -0.1205 -0.0574 -0.1031 0.1599 0.1565 0.1596 0.1604 0.1164 0.1902 0.1986 -0.1529 -0.1895 0.0914 -0.0750 0.1321 -0.1323 0.1532 0.1436 0.4434 -0.3665 -0.2166 0.2268 -0.2755 0.1489 0.1290 0.0645 -0.0074 0.2159
va: 3.9977 4.0243 3.9746 3.9256 3.9674 3.9735 0.9947 0.9931 1.0109 0.9946 3.6820 1.0018 3.4413 3.8886 4.0879 4.0160 3.9896 1.0153 4.0247 0.9963 1.0071 4.1904 2.1267 2.2933 1.0250 3.9535 0.9912 0.9964 1.0117 1.3267 1.0761
dispcorr: -0.014950000 hartree
energy: -1206.602668185402
dipole: 10.31102 -8.42488 1.88614 3.16866 -2.88202 0.28664 -0.28843 0.06559 -0.22284
magnitude: 1.92077 au
magnitude: 4.88220 debye
temp: 298.15 k
press: 1.00 atm
zeropoint: 0.24836628 hartree
thermalvibcorrection: 0.01263022 hartree
thermalrotcorrection: 0.00141627 hartree
thermaltrasncorrection: 0.00141627 hartree
thermaltotal: -1206.33883915 hartree
thermalcorr: 0.01546276 hartree
nonthermalcorr: 0.24836628 hartree
totalcorr: 0.26382904 hartree
thermalcorrenthalpy: 0.00094421 hartree
totalenthalpy: -1206.33789494 hartree
totalentropycorr: -0.05844147 hartree
gibbsenthalpy: -1206.39633640 hartree
gibbsminuselec: 0.20633178 hartree
