program: Orca
programVersion: 5.0.2
elementType: C C C C C C H H H H C H H H S O O N C N H H O H C H H C H H C H H C H H H
charge: 1
multiplicity: 1
keywords: wB97X-D3 TightOpt Freq def2-TZVPP def2/J RIJCOSX TightSCF defgrid3 CHELPG
frequency: 0.00 0.00 0.00 0.00 0.00 0.00 7.98 17.00 32.21 44.03 53.10 64.36 77.11 96.36 114.40 171.64 173.90 193.21 209.40 238.40 247.81 294.34 308.32 318.44 345.90 363.24 414.65 422.59 442.87 452.65 469.21 502.49 558.28 593.58 601.50 648.78 682.86 724.34 730.66 748.81 754.28 805.36 814.25 833.47 840.80 850.69 873.12 922.73 962.42 1003.38 1019.59 1028.35 1030.38 1041.13 1051.77 1073.10 1089.20 1118.24 1126.15 1158.54 1159.63 1186.41 1201.22 1227.51 1255.04 1264.47 1289.31 1320.30 1334.15 1339.99 1346.98 1347.69 1374.77 1394.24 1426.29 1427.26 1433.22 1454.87 1470.79 1491.96 1495.37 1497.72 1499.75 1501.80 1507.29 1513.53 1525.43 1547.97 1621.29 1648.93 1675.34 1742.15 3038.68 3055.92 3062.17 3070.57 3077.71 3088.78 3099.74 3134.61 3141.82 3145.30 3151.56 3167.82 3211.66 3213.22 3229.20 3233.72 3329.02 3635.74 3655.05
frequency: 7.98 17.00 32.21 44.03 53.10 64.36 77.11 96.36 114.40 171.64 173.90 193.21 209.40 238.40 247.81 294.34 308.32 318.44 345.90 363.24 414.65 422.59 442.87 452.65 469.21 502.49 558.28 593.58 601.50 648.78 682.86 724.34 730.66 748.81 754.28 805.36 814.25 833.47 840.80 850.69 873.12 922.73 962.42 1003.38 1019.59 1028.35 1030.38 1041.13 1051.77 1073.10 1089.20 1118.24 1126.15 1158.54 1159.63 1186.41 1201.22 1227.51 1255.04 1264.47 1289.31 1320.30 1334.15 1339.99 1346.98 1347.69 1374.77 1394.24 1426.29 1427.26 1433.22 1454.87 1470.79 1491.96 1495.37 1497.72 1499.75 1501.80 1507.29 1513.53 1525.43 1547.97 1621.29 1648.93 1675.34 1742.15 3038.68 3055.92 3062.17 3070.57 3077.71 3088.78 3099.74 3134.61 3141.82 3145.30 3151.56 3167.82 3211.66 3213.22 3229.20 3233.72 3329.02 3635.74 3655.05
formula: C12H19N2O3S
InChI: InChI=1S/C12H19N2O3S/c1-3-4-9-13-12(15)14-18(16,17)11-7-5-10(2)6-8-11/h5-8,13-15H,3-4,9H2,1-2H3
37 atoms
C  4.202993 1.735594 -0.041452
C  4.077317 0.906534 -1.155729
C  3.165201 -0.130515 -1.176461
C  2.361832 -0.335663 -0.059861
C  2.466354 0.471599 1.069013
C  3.384611 1.501331 1.065366
H  4.712036 1.069827 -2.017318
H  3.0899 -0.784806 -2.034483
H  1.857759 0.283884 1.943571
H  3.479411 2.129945 1.941582
C  5.224374 2.832079 -0.016429
H  6.168283 2.450929 0.378866
H  5.418592 3.218281 -1.015507
H  4.909431 3.656049 0.621532
S  1.216749 -1.63665 -0.082056
O  0.923894 -2.061439 1.257427
O  1.511027 -2.548491 -1.120333
N  -0.259408 -0.911922 -0.57929
C  -1.316654 -0.594142 0.198698
N  -2.361852 0.015582 -0.300045
H  -0.337385 -0.778642 -1.576285
H  -2.336075 0.309288 -1.262912
O  -1.338361 -0.884839 1.455639
H  -0.544223 -1.425153 1.691398
C  -3.580403 0.321861 0.46875
H  -3.840216 -0.559054 1.054813
H  -3.360677 1.134493 1.162794
C  -4.706263 0.699791 -0.476896
H  -4.893864 -0.127362 -1.168152
H  -4.403933 1.562765 -1.08016
C  -5.9886 1.037232 0.277192
H  -6.285138 0.178281 0.885214
H  -5.79261 1.855993 0.974906
C  -7.125701 1.420866 -0.659592
H  -7.364451 0.606827 -1.345935
H  -8.029361 1.656821 -0.099573
H  -6.867933 2.297246 -1.256659
totalener: -1201.96498692 hartree
nucrepener: 1470.61348359 hartree
electener: -2672.57847051 hartree
oneelecener: -4543.45295536 hartree
twoeener: 1870.87448485 hartree
kineticenergy: 1196.87477733 hartree
xcener: -96.000653510829 hartree
chargesum: 1.0000000
charge: 0.010657 -0.120153 -0.084048 -0.066769 -0.102711 -0.131707 0.139609 0.156203 0.134957 0.138399 -0.170837 0.119035 0.097864 0.096571 0.839303 -0.426981 -0.374578 -0.193175 0.479752 -0.150880 0.161431 0.153195 -0.239456 0.250796 -0.033633 0.118441 0.123296 -0.130199 0.088081 0.069980 -0.108935 0.072374 0.069549 -0.247453 0.080822 0.101984 0.079216
charge: -0.041564 0.024120 0.002779 -0.268873 -0.004501 0.023148 0.036064 0.033750 0.028252 0.035362 0.042418 0.035955 0.027554 0.027013 0.728296 -0.162501 -0.180945 0.177723 -0.352982 0.375215 -0.017820 0.002150 0.444523 -0.141678 -0.017889 0.032876 0.030253 -0.035607 0.025863 0.023193 -0.035893 0.023183 0.022427 0.010534 0.014576 0.019056 0.013970
qa: 0.0107 -0.1202 -0.0840 -0.0668 -0.1027 -0.1317 0.1396 0.1562 0.1350 0.1384 -0.1708 0.1190 0.0979 0.0966 0.8393 -0.4270 -0.3746 -0.1932 0.4798 -0.1509 0.1614 0.1532 -0.2395 0.2508 -0.0336 0.1184 0.1233 -0.1302 0.0881 0.0700 -0.1089 0.0724 0.0695 -0.2475 0.0808 0.1020 0.0792
va: 3.8173 3.9875 3.9988 3.7933 4.0206 4.0077 1.0040 1.0094 1.0154 1.0043 3.8956 0.9953 1.0045 1.0044 5.8384 2.0648 2.1502 3.2632 4.1979 3.3541 1.0360 1.0275 2.3158 1.0812 3.7955 1.0069 1.0048 3.8761 1.0061 1.0067 3.9308 1.0055 1.0065 3.9591 1.0024 1.0070 1.0024
dispcorr: -0.014399486 hartree
energy: -1201.986549406166
dipole: -24.34052 23.37987 -0.96065 18.56109 -16.96372 1.59737 -2.19113 1.54949 -0.64165
magnitude: 1.97133 au
magnitude: 5.01073 debye
temp: 298.15 k
press: 1.00 atm
zeropoint: 0.31216901 hartree
thermalvibcorrection: 0.01649666 hartree
thermalrotcorrection: 0.00141627 hartree
thermaltrasncorrection: 0.00141627 hartree
thermaltotal: -1201.65505120 hartree
thermalcorr: 0.01932920 hartree
nonthermalcorr: 0.31216901 hartree
totalcorr: 0.33149821 hartree
thermalcorrenthalpy: 0.00094421 hartree
totalenthalpy: -1201.65410699 hartree
totalentropycorr: -0.06709802 hartree
gibbsenthalpy: -1201.72120501 hartree
gibbsminuselec: 0.26534440 hartree
