program: Orca
programVersion: 5.0.2
elementType: N C H C C O N C O H C H H H H H
charge: 1
multiplicity: 1
keywords: wB97X-D3 TightOpt Freq def2-TZVPP def2/J RIJCOSX TightSCF defgrid3 CHELPG
frequency: 0.00 0.00 0.00 0.00 0.00 0.00 114.04 142.07 193.19 286.27 299.29 378.44 423.12 464.82 476.95 553.30 602.42 672.21 699.50 771.58 772.18 795.00 808.62 981.04 992.53 1031.62 1089.06 1162.22 1194.12 1247.55 1278.32 1374.86 1394.39 1445.27 1484.19 1498.30 1510.49 1606.17 1651.45 1711.33 1917.63 3082.13 3155.87 3176.00 3232.49 3598.32 3630.38 3835.76
frequency: 114.04 142.07 193.19 286.27 299.29 378.44 423.12 464.82 476.95 553.30 602.42 672.21 699.50 771.58 772.18 795.00 808.62 981.04 992.53 1031.62 1089.06 1162.22 1194.12 1247.55 1278.32 1374.86 1394.39 1445.27 1484.19 1498.30 1510.49 1606.17 1651.45 1711.33 1917.63 3082.13 3155.87 3176.00 3232.49 3598.32 3630.38 3835.76
formula: C5H7N2O2
InChI: InChI=1S/C5H7N2O2/c1-3-2-6-5(9)7-4(3)8/h2,6-8H,1H3
16 atoms
N  -1.167857 -1.238776 -0.000039
C  0.152522 -1.509771 -0.000027
H  0.414688 -2.560179 -0.000074
C  1.112348 -0.542151 0.000025
C  0.626719 0.779326 0.000038
O  1.486123 1.757098 0.000054
N  -0.689964 1.02358 0.000029
C  -1.698857 0.038442 0.000039
O  -2.856662 0.307674 -0.000086
H  1.10742 2.643032 0.000059
C  2.584758 -0.823437 0.000036
H  3.064634 -0.39733 -0.88037
H  3.064603 -0.397424 0.880505
H  2.764011 -1.896232 -0.000018
H  -1.847884 -1.985628 -0.000104
H  -1.05401 1.968138 0.000023
totalener: -454.53538187 hartree
nucrepener: 451.75774455 hartree
electener: -906.29312642 hartree
oneelecener: -1500.31218986 hartree
twoeener: 594.01906344 hartree
kineticenergy: 452.37152372 hartree
xcener: -42.007964376341 hartree
chargesum: 1.0000000
charge: -0.118580 0.157471 0.153135 -0.182058 0.382765 -0.163976 -0.109973 0.337238 -0.251670 0.219374 -0.139306 0.116800 0.116807 0.094239 0.208146 0.179588
charge: 0.392720 0.050183 0.054823 -0.104239 -0.189153 0.480835 0.395997 -0.417500 0.172942 -0.060606 0.051931 0.036100 0.036101 0.034181 0.035485 0.030200
qa: -0.1186 0.1575 0.1531 -0.1821 0.3828 -0.1640 -0.1100 0.3372 -0.2517 0.2194 -0.1393 0.1168 0.1168 0.0942 0.2081 0.1796
va: 3.4021 3.9555 0.9971 3.7942 4.1159 2.3840 3.3647 4.3701 2.2543 1.0298 3.9008 0.9985 0.9985 1.0082 0.9952 1.0185
dispcorr: -0.004604118 hartree
energy: -454.541402649253
dipole: 7.38313 -6.39248 0.99065 -2.57220 2.60927 0.03707 -0.00002 0.00007 0.00005
magnitude: 0.99134 au
magnitude: 2.51980 debye
temp: 298.15 k
press: 1.00 atm
zeropoint: 0.12925064 hartree
thermalvibcorrection: 0.00506484 hartree
thermalrotcorrection: 0.00141627 hartree
thermaltrasncorrection: 0.00141627 hartree
thermaltotal: -454.40425462 hartree
thermalcorr: 0.00789738 hartree
nonthermalcorr: 0.12925064 hartree
totalcorr: 0.13714802 hartree
thermalcorrenthalpy: 0.00094421 hartree
totalenthalpy: -454.40331042 hartree
totalentropycorr: -0.04110952 hartree
gibbsenthalpy: -454.44441994 hartree
gibbsminuselec: 0.09698271 hartree
