program: Gaussian 09
title: 000044719
version: EM64L-G09RevD.01
frameworkgroup: C1[X(C14H20ClNO2)]
method: RPBEPBE
basis: SDD
operation: Freq
keyword: #p
keyword: freq=noraman
keyword: PBEPBE/SDD
title: #p freq=noraman PBEPBE/SDD
converged: YES YES NO NO
title: Mulliken charges:
elementType: Cl O O N C C C C C C C C C C C C C C H H H H H H H H H H H H H H H H H H H H
charge: -0.044255 -0.419452 -0.288376 -0.136043 -0.217736 -0.431969 0.427476 -0.436617 -0.088975 -0.526475 0.087648 -0.405901 0.322604 -0.289654 -0.334496 -0.645620 -0.629844 -0.513911 0.223584 0.228314 0.175974 0.208514 0.211616 0.217866 0.262669 0.212179 0.225517 0.251890 0.330263 0.225272 0.236802 0.201774 0.191591 0.260654 0.223361 0.214599 0.234754 0.234402
chargesum: 0.00000
title: Mulliken charges with hydrogens summed into heavy atoms:
elementType: Cl O O N C C C C C C C C C C C C C C
charge: -0.044255 -0.089189 -0.288376 -0.136043 0.005849 -0.027681 0.427476 -0.016486 0.128891 -0.051627 0.087648 -0.180385 0.322604 -0.037763 -0.334496 0.018228 0.045762 0.169844
polarizability: 2.31705337e+02 3.24447885e+00 1.72145827e+02 -1.04187066e+01 7.32643744e+00 1.18042780e+02
1716.lowfreq: -10.9344 -5.9854 -0.0016 -0.0016 0.0010 6.4121 22.3330 40.5183 59.6779
frequency: 22.2390 40.3445 59.6725 74.0990 86.6839 98.7536 130.4683 143.6457 171.9339 181.6890 192.5643 202.0754 216.9541 244.4154 279.4144 289.2249 302.3149 323.1736 331.4662 336.4285 355.8217 369.6094 430.5658 440.9215 454.0276 514.1348 520.1251 531.8990 541.6636 608.3781 620.5702 684.3731 691.4191 757.7386 783.3691 807.3059 818.5720 850.8749 868.3260 873.2499 912.2120 933.6374 943.1400 972.7754 1009.4675 1035.2033 1042.7723 1051.1566 1079.9383 1094.8076 1100.1992 1110.5312 1128.1650 1134.6480 1145.3698 1152.6495 1173.2875 1181.6536 1207.4472 1208.0362 1217.6204 1241.5082 1256.5289 1268.4286 1289.2453 1306.0516 1319.4015 1335.0563 1345.0407 1351.0018 1361.0368 1371.0621 1397.6849 1417.0098 1439.8671 1443.5666 1448.8059 1458.3660 1462.6922 1468.0257 1470.1394 1472.7409 1473.8282 1476.1976 1484.4654 1490.3527 1578.2621 1585.0308 2874.2203 2884.2357 2930.7044 2959.0094 2965.5905 2966.7559 2974.4337 2983.6956 3036.5465 3038.4859 3044.8812 3050.5345 3056.1042 3059.6275 3093.2041 3112.4515 3120.5118 3132.5202 3168.7787 3521.2035
redmass: 3.9531 4.4650 3.6677 2.8229 3.5386 2.5625 3.2461 1.2201 3.3069 2.2695 1.9044 3.0993 2.5339 1.5535 3.1935 2.2713 3.8837 3.2989 3.9600 4.4133 2.8904 1.4337 2.3292 2.9020 4.1787 3.9845 3.0801 3.7889 4.6007 5.0958 3.4634 3.3999 4.3258 5.1694 2.1711 3.3071 2.3581 3.5772 1.7759 2.7708 2.3268 1.6269 2.2308 3.5511 2.4880 1.5004 2.8415 2.0313 2.4292 1.4343 1.9912 1.2469 1.5944 1.3626 1.5496 1.3519 1.7798 1.7434 2.3391 2.1591 1.7982 1.8614 1.5612 2.2151 1.3737 1.3529 1.6174 1.3997 1.4804 1.4752 2.0542 1.7340 2.9667 1.1367 1.3931 1.1587 1.6951 1.0847 1.1826 1.1552 1.0884 1.0938 1.0820 1.0554 1.0516 1.0545 7.7097 7.3004 1.0563 1.0563 1.0814 1.0676 1.0341 1.0757 1.0711 1.0604 1.0751 1.0767 1.0989 1.0942 1.0956 1.1033 1.0990 1.0985 1.1015 1.0884 1.0955 1.0643
irintensity: 1.1774 1.2292 1.2582 4.7936 1.0270 0.3342 1.1490 0.5834 6.9654 0.4256 2.8965 0.0568 0.9873 0.9171 12.8332 2.1153 0.8061 5.5867 1.4514 6.4018 27.0788 121.5839 14.2921 5.0611 1.5227 1.9133 43.7419 2.3803 2.1706 4.5513 9.9850 11.2968 7.5117 4.3320 64.0398 14.0658 4.8235 35.5575 5.0621 0.9851 32.7961 2.3283 10.8932 98.2130 71.1083 22.8117 15.6379 26.5673 42.4514 4.4866 0.0368 1.9216 12.2025 7.7589 8.9629 7.7064 15.6061 22.7507 15.1867 38.4915 9.0258 13.5658 20.1506 17.1986 10.3521 19.1277 4.4301 6.0328 4.3525 6.6108 27.0396 7.9293 48.0040 6.2592 13.8381 10.5971 20.4180 16.7645 31.1676 20.3954 4.4608 11.8623 17.5206 3.3526 26.4668 18.9419 4.4271 1.6016 55.0439 152.2034 70.6344 9.1224 78.2321 7.5647 37.2868 46.4690 25.7190 62.4657 58.8961 33.9144 27.5363 33.9395 43.0527 11.1464 25.7832 14.2348 5.4795 1.9817
temp: 298.150 k
press: 1.00000 atm
elementType: 17 8 8 7 6 6 6 6 6 6 6 6 6 6 6 6 6 6 1 1 1 1 1 1 1 1 1 1 1 1 1 1 1 1 1 1 1 1
symmnumber: 1
zpe: 825842.7 jmol-1
zpe.correction: 0.314547 hartree
zpe.thermalcorrener: 0.333534 hartree
zpe.thermalcorrenthalpy: 0.334478 hartree
zpe.thermalcorrgfe: 0.266803 hartree
zpe.sumelectzpe: -1209.322754 hartree
zpe.sumelectthermal: -1209.303767 hartree
zpe.sumelectthermalent: -1209.302823 hartree
zpe.sumelectthermalfe: -1209.370498 hartree
dipole: 3.5348 1.1772 -0.0368
dipole: 3.7259
quadrupole: -112.8358 -109.5344 -115.4443
quadrupole: -4.3595 -10.7892 6.1557
quadrupole: -0.2310 3.0705 -2.8395 -4.3595 -10.7892 6.1557
hfenergy: -1209.6373013 hartree
pointgroup: C01 [X(C14H20Cl1N1O2)]
dipole: -1.3700893 0.5211119 0.0096852 debye
polarizability: 231.2142995|-6.0125728|172.1726266|-11.1798929|-8.1083726|118.5070177 unknown
InChI: InChI=1S/C14H20ClNO2/c1-16(2)14(17)11-6-4-5-10-9(11)7-8-12(15)13(10)18-3/h7-8,11,14,17H,4-6H2,1-3H3
charge 0 multiplicity 1
38 atoms
Cl 4.342896 -1.849916 0.183625
O  -2.108387 -0.429182 -1.822017
O  3.460884 1.083109 -0.113418
N  -3.854366 -0.242891 -0.200908
C  -1.466969 0.285641 0.493649
C  -1.620666 1.794031 0.174704
C  -0.013362 -0.211859 0.387436
C  -0.44716 2.62086 0.732475
C  -2.422851 -0.577371 -0.395358
C  0.861311 2.186735 0.043786
C  1.068861 0.681045 0.148777
C  0.268818 -1.588826 0.581367
C  2.397103 0.171712 0.064943
C  1.581005 -2.095848 0.514679
C  2.63664 -1.207396 0.246497
C  -4.317684 -0.115954 1.199003
C  -4.736164 -1.162643 -0.965566
C  3.996998 1.158118 -1.48843
H  -1.770892 0.119761 1.548245
H  -2.589737 2.159137 0.558581
H  -1.642456 1.941522 -0.924721
H  -0.362419 2.47325 1.827714
H  -0.623431 3.69941 0.560953
H  -2.225385 -1.658895 -0.220317
H  1.738413 2.699898 0.474733
H  0.8226 2.487551 -1.024604
H  -0.543957 -2.289988 0.799444
H  1.783907 -3.158999 0.671425
H  -2.440863 0.466775 -2.093314
H  -5.395971 0.122313 1.189241
H  -3.803217 0.707772 1.719467
H  -4.184292 -1.050718 1.797605
H  -4.801825 -2.177622 -0.50225
H  -4.345603 -1.276973 -1.988266
H  -5.75443 -0.738262 -1.016119
H  3.209647 1.478735 -2.198351
H  4.412944 0.184035 -1.805022
H  4.798659 1.911033 -1.44909
