program: Orca
programVersion: 5.0.2
elementType: N C H C C O N C O H C H H H H H
charge: 1
multiplicity: 1
keywords: wB97X-D3 TightOpt Freq def2-TZVPP def2/J RIJCOSX TightSCF defgrid3 CHELPG
frequency: 0.00 0.00 0.00 0.00 0.00 0.00 113.93 145.20 195.19 278.84 297.01 376.83 424.41 475.55 528.29 554.90 597.06 690.06 726.00 768.29 772.91 804.57 806.14 974.36 995.63 1024.06 1086.22 1188.34 1198.14 1247.68 1290.52 1371.07 1386.94 1442.09 1492.75 1501.24 1515.39 1615.73 1630.89 1726.40 1920.26 3059.85 3126.33 3170.12 3229.79 3593.22 3629.55 3825.64
frequency: 113.93 145.20 195.19 278.84 297.01 376.83 424.41 475.55 528.29 554.90 597.06 690.06 726.00 768.29 772.91 804.57 806.14 974.36 995.63 1024.06 1086.22 1188.34 1198.14 1247.68 1290.52 1371.07 1386.94 1442.09 1492.75 1501.24 1515.39 1615.73 1630.89 1726.40 1920.26 3059.85 3126.33 3170.12 3229.79 3593.22 3629.55 3825.64
formula: C5H7N2O2
InChI: InChI=1S/C5H7N2O2/c1-3-2-6-5(9)7-4(3)8/h2,6-8H,1H3
16 atoms
N  -1.165116 -1.238282 -0.000036
C  0.151457 -1.509001 -0.000032
H  0.415495 -2.559176 -0.000098
C  1.10879 -0.53689 0.000032
C  0.615012 0.781957 0.000033
O  1.356434 1.85131 0.00004
N  -0.697462 1.02501 0.000039
C  -1.70135 0.044194 0.000095
O  -2.861995 0.297335 -0.000112
H  2.299229 1.649066 0.000045
C  2.58389 -0.811187 0.00004
H  3.069742 -0.402021 -0.888384
H  3.069719 -0.4021 0.888514
H  2.772335 -1.882291 -0.000007
H  -1.8454 -1.985007 -0.000123
H  -1.023035 1.984576 0.000014
totalener: -454.54029483 hartree
nucrepener: 452.00751871 hartree
electener: -906.54781354 hartree
oneelecener: -1500.67471538 hartree
twoeener: 594.12690183 hartree
kineticenergy: 452.37406273 hartree
xcener: -42.010539382116 hartree
chargesum: 1.0000000
charge: -0.119689 0.156489 0.152150 -0.168322 0.402098 -0.197365 -0.106999 0.332834 -0.246616 0.249368 -0.215682 0.122989 0.122998 0.096380 0.207592 0.211776
charge: 0.393991 0.048545 0.055003 -0.116514 -0.193439 0.471782 0.409393 -0.416128 0.176820 -0.055573 0.040553 0.032111 0.032113 0.041594 0.035328 0.044419
qa: -0.1197 0.1565 0.1522 -0.1683 0.4021 -0.1974 -0.1070 0.3328 -0.2466 0.2494 -0.2157 0.1230 0.1230 0.0964 0.2076 0.2118
va: 3.4090 3.9569 0.9974 3.7439 4.1058 2.3554 3.3605 4.3666 2.2586 1.0137 3.8960 0.9903 0.9903 1.0118 0.9958 0.9997
dispcorr: -0.004608653 hartree
energy: -454.546309600148
dipole: 8.61161 -6.77055 1.84106 -3.51913 2.73612 -0.78301 -0.00008 0.00016 0.00008
magnitude: 2.00065 au
magnitude: 5.08525 debye
temp: 298.15 k
press: 1.00 atm
zeropoint: 0.12939397 hartree
thermalvibcorrection: 0.00500503 hartree
thermalrotcorrection: 0.00141627 hartree
thermaltrasncorrection: 0.00141627 hartree
thermaltotal: -454.40907806 hartree
thermalcorr: 0.00783757 hartree
nonthermalcorr: 0.12939397 hartree
totalcorr: 0.13723154 hartree
thermalcorrenthalpy: 0.00094421 hartree
totalenthalpy: -454.40813385 hartree
totalentropycorr: -0.04101325 hartree
gibbsenthalpy: -454.44914710 hartree
gibbsminuselec: 0.09716250 hartree
