program: Orca
programVersion: 5.0.2
elementType: C C C C C C C C C C H C C C H H H H H H S C H C H H C H H C C C H H C H H H H H H N N C H H H S O O N C H H H C H H H H
charge: 1
multiplicity: 1
keywords: wB97X-D3 TightOpt Freq def2-TZVPP def2/J RIJCOSX TightSCF defgrid3 CHELPG
frequency: 0.00 0.00 0.00 0.00 0.00 0.00 23.80 33.04 36.29 43.49 55.14 73.52 75.43 88.07 91.93 105.51 112.54 131.09 151.41 170.64 178.21 189.01 195.42 213.39 222.57 230.54 237.60 251.23 254.13 264.71 308.41 320.28 335.80 354.51 362.65 368.14 384.00 388.96 395.73 410.71 416.38 443.15 459.71 462.11 467.41 497.74 505.97 506.67 512.94 524.98 558.30 568.93 625.44 630.36 636.16 668.68 706.44 707.68 739.04 752.74 766.74 783.60 799.76 804.30 808.14 844.01 856.78 865.98 870.96 897.47 916.35 944.21 966.87 987.92 995.04 1001.35 1007.69 1015.35 1021.96 1041.48 1045.34 1056.36 1066.67 1077.02 1080.62 1087.59 1101.41 1106.07 1108.66 1117.46 1129.02 1132.78 1136.44 1139.99 1166.53 1174.45 1178.19 1180.30 1186.13 1192.32 1200.92 1211.37 1221.79 1245.53 1252.47 1268.15 1273.47 1303.66 1311.85 1315.00 1318.15 1320.06 1330.20 1342.37 1346.82 1353.58 1367.30 1378.80 1383.69 1389.02 1405.99 1416.65 1443.03 1450.19 1454.83 1463.47 1477.64 1481.80 1482.96 1487.10 1490.26 1495.18 1496.37 1497.89 1499.15 1505.67 1506.34 1508.69 1512.14 1515.06 1516.15 1521.76 1527.00 1527.42 1532.05 1627.34 1650.68 1668.65 1678.80 1723.11 2965.59 2987.39 2989.51 3058.97 3062.20 3091.44 3097.76 3100.09 3105.73 3111.57 3118.99 3122.78 3130.74 3141.37 3145.17 3156.93 3162.01 3167.41 3167.66 3173.12 3196.51 3197.35 3204.23 3209.25 3212.41 3220.72 3230.40 3232.81 3234.49 3239.88
frequency: 23.80 33.04 36.29 43.49 55.14 73.52 75.43 88.07 91.93 105.51 112.54 131.09 151.41 170.64 178.21 189.01 195.42 213.39 222.57 230.54 237.60 251.23 254.13 264.71 308.41 320.28 335.80 354.51 362.65 368.14 384.00 388.96 395.73 410.71 416.38 443.15 459.71 462.11 467.41 497.74 505.97 506.67 512.94 524.98 558.30 568.93 625.44 630.36 636.16 668.68 706.44 707.68 739.04 752.74 766.74 783.60 799.76 804.30 808.14 844.01 856.78 865.98 870.96 897.47 916.35 944.21 966.87 987.92 995.04 1001.35 1007.69 1015.35 1021.96 1041.48 1045.34 1056.36 1066.67 1077.02 1080.62 1087.59 1101.41 1106.07 1108.66 1117.46 1129.02 1132.78 1136.44 1139.99 1166.53 1174.45 1178.19 1180.30 1186.13 1192.32 1200.92 1211.37 1221.79 1245.53 1252.47 1268.15 1273.47 1303.66 1311.85 1315.00 1318.15 1320.06 1330.20 1342.37 1346.82 1353.58 1367.30 1378.80 1383.69 1389.02 1405.99 1416.65 1443.03 1450.19 1454.83 1463.47 1477.64 1481.80 1482.96 1487.10 1490.26 1495.18 1496.37 1497.89 1499.15 1505.67 1506.34 1508.69 1512.14 1515.06 1516.15 1521.76 1527.00 1527.42 1532.05 1627.34 1650.68 1668.65 1678.80 1723.11 2965.59 2987.39 2989.51 3058.97 3062.20 3091.44 3097.76 3100.09 3105.73 3111.57 3118.99 3122.78 3130.74 3141.37 3145.17 3156.93 3162.01 3167.41 3167.66 3173.12 3196.51 3197.35 3204.23 3209.25 3212.41 3220.72 3230.40 3232.81 3234.49 3239.88
formula: C23H30N3O2S2
InChI: InChI=1S/C23H30N3O2S2/c1-24(2)30(27,28)18-10-11-23-21(17-18)19(20-7-4-5-9-22(20)29-23)8-6-12-26-15-13-25(3)14-16-26/h4-5,7-11,17,26H,6,12-16H2,1-3H3
60 atoms
C  -6.161633 -1.021345 -1.394203
C  -4.790292 -1.057513 -1.570885
C  -3.929221 -0.663125 -0.550606
C  -4.476041 -0.18854 0.643037
C  -5.85383 -0.14769 0.821422
C  -6.692736 -0.5733 -0.193022
C  -2.460469 -0.739317 -0.689574
C  -2.029614 0.86567 1.170156
C  -1.705771 0.390215 -0.104851
C  -0.598619 0.920755 -0.749315
H  -0.387973 0.655057 -1.775045
C  0.281957 1.739464 -0.066977
C  0.013247 2.146556 1.234551
C  -1.171965 1.753702 1.824743
H  -6.81715 -1.333602 -2.196056
H  -4.372814 -1.385883 -2.514521
H  -6.266036 0.225068 1.750492
H  -7.764624 -0.536949 -0.051012
H  0.712003 2.779453 1.764962
H  -1.43065 2.116116 2.811416
S  -3.465418 0.316464 1.998466
C  -1.852994 -1.814822 -1.205141
H  -2.486885 -2.623593 -1.548885
C  -0.361869 -2.06684 -1.301224
H  -0.207082 -3.011788 -1.82057
H  0.133782 -1.308759 -1.90854
C  0.289194 -2.130492 0.08354
H  -0.134283 -1.380547 0.748323
H  0.133518 -3.107953 0.540014
C  2.518401 -2.794063 -0.833021
C  2.30639 -1.97354 1.472783
C  4.00717 -2.52854 -0.739206
H  2.286262 -3.814775 -0.527215
H  2.157559 -2.626617 -1.84517
C  3.804885 -1.753427 1.494553
H  1.786458 -1.222893 2.066392
H  2.059008 -2.967536 1.844828
H  4.514444 -3.244841 -1.385949
H  4.227837 -1.520197 -1.129259
H  4.145683 -1.907362 2.518996
H  4.031288 -0.710302 1.222807
N  1.765442 -1.883088 0.079804
N  4.465093 -2.702128 0.622564
C  5.910704 -2.621446 0.727537
H  6.213192 -2.810863 1.756721
H  6.366642 -3.38359 0.096902
H  6.302739 -1.639174 0.424609
S  1.861326 1.912887 -0.823003
O  2.660087 0.811858 -0.311014
O  1.679366 1.974217 -2.238669
N  2.467843 3.275929 -0.189496
C  3.904178 3.334572 0.078211
H  4.482491 3.516178 -0.83097
H  4.075804 4.152568 0.77574
H  4.233057 2.407516 0.53665
C  1.881884 4.508868 -0.717296
H  0.804316 4.396885 -0.826111
H  2.072031 5.306666 -0.001696
H  2.306579 4.776702 -1.68678
H  1.944704 -0.91027 -0.22655
totalener: -2005.47664163 hartree
nucrepener: 3474.89460682 hartree
electener: -5480.37124845 hartree
oneelecener: -9629.15344753 hartree
twoeener: 4148.78219908 hartree
kineticenergy: 1997.33811821 hartree
xcener: -157.487551551709 hartree
chargesum: 1.0000000
charge: -0.110027 -0.204157 0.079050 -0.066823 -0.084720 -0.123451 0.054870 -0.051777 0.081153 -0.224751 0.169701 -0.052034 -0.147039 -0.084119 0.140503 0.137837 0.124995 0.141946 0.149113 0.134814 0.048596 -0.194866 0.121562 -0.120101 0.114937 0.107628 -0.179200 0.147639 0.149223 -0.119858 -0.118835 -0.132500 0.134658 0.130021 -0.142382 0.129663 0.131925 0.109641 0.116215 0.110220 0.122663 0.153491 -0.172328 -0.182852 0.099002 0.100270 0.089120 0.850809 -0.541543 -0.426991 -0.205550 -0.182863 0.123990 0.106992 0.113947 -0.181911 0.121524 0.112209 0.133574 0.157180
charge: 0.001583 0.013303 -0.080350 -0.288582 -0.025915 0.005518 -0.058356 -0.290722 -0.078629 0.001047 0.033665 -0.242857 -0.013377 -0.017599 0.027790 0.028865 0.026225 0.029309 0.029120 0.030911 0.734575 0.024094 0.027156 -0.023654 0.030990 0.023551 0.008055 0.035195 0.035235 0.007156 0.007855 -0.080004 0.037220 0.032815 -0.081538 0.034373 0.035700 0.037192 0.021686 0.036377 0.017818 0.448245 0.171114 -0.033616 0.017668 0.017953 0.004971 0.688803 -0.259712 -0.234685 0.023660 -0.034617 0.013280 0.019861 0.009256 -0.033216 0.018100 0.020475 0.016258 -0.006594
qa: -0.1100 -0.2042 0.0790 -0.0668 -0.0847 -0.1235 0.0549 -0.0518 0.0812 -0.2248 0.1697 -0.0520 -0.1470 -0.0841 0.1405 0.1378 0.1250 0.1419 0.1491 0.1348 0.0486 -0.1949 0.1216 -0.1201 0.1149 0.1076 -0.1792 0.1476 0.1492 -0.1199 -0.1188 -0.1325 0.1347 0.1300 -0.1424 0.1297 0.1319 0.1096 0.1162 0.1102 0.1227 0.1535 -0.1723 -0.1829 0.0990 0.1003 0.0891 0.8508 -0.5415 -0.4270 -0.2055 -0.1829 0.1240 0.1070 0.1139 -0.1819 0.1215 0.1122 0.1336 0.1572
va: 3.9814 4.0062 3.5623 3.9969 3.9148 4.0087 3.6240 4.0253 3.4218 3.8987 1.0041 3.7187 4.0245 3.9372 0.9997 1.0071 1.0090 0.9975 1.0111 1.0076 2.5541 3.9391 1.0160 3.8932 1.0117 1.0097 3.7933 1.0001 1.0081 3.8512 3.8393 3.9417 1.0102 1.0077 3.9482 1.0107 1.0153 1.0094 1.0195 1.0096 1.0103 3.5274 2.8871 3.9544 0.9982 0.9987 0.9976 5.8400 1.9512 2.0606 3.0026 3.9118 0.9922 0.9939 1.0086 3.9064 0.9983 0.9937 1.0005 1.1210
dispcorr: -0.037705925 hartree
energy: -2005.523077659711
dipole: 35.06754 -32.96992 2.09761 -11.05741 9.94282 -1.11459 -1.13532 1.75770 0.62238
magnitude: 2.45553 au
magnitude: 6.24147 debye
temp: 298.15 k
press: 1.00 atm
zeropoint: 0.51267899 hartree
thermalvibcorrection: 0.02514508 hartree
thermalrotcorrection: 0.00141627 hartree
thermaltrasncorrection: 0.00141627 hartree
thermaltotal: -2004.98242105 hartree
thermalcorr: 0.02797763 hartree
nonthermalcorr: 0.51267899 hartree
totalcorr: 0.54065661 hartree
thermalcorrenthalpy: 0.00094421 hartree
totalenthalpy: -2004.98147684 hartree
totalentropycorr: -0.08263612 hartree
gibbsenthalpy: -2005.06411296 hartree
gibbsminuselec: 0.45896470 hartree
