program: Orca
programVersion: 5.0.2
elementType: C C C C C C C H H H H H N N C C H C H S N H
charge: 1
multiplicity: 1
keywords: wB97X-D3 TightOpt Freq def2-TZVPP def2/J RIJCOSX TightSCF defgrid3 CHELPG
frequency: 0.00 0.00 0.00 0.00 0.00 0.00 52.01 66.26 99.38 193.95 259.38 295.61 337.73 344.71 443.78 502.84 533.25 579.14 580.23 595.78 638.59 663.76 673.47 714.81 760.50 783.01 786.15 807.23 819.91 858.82 888.17 893.01 911.88 921.98 927.44 997.54 1022.12 1045.34 1050.91 1146.15 1159.22 1184.97 1227.39 1248.37 1268.85 1287.38 1335.74 1373.93 1390.27 1413.72 1502.89 1517.70 1527.97 1559.25 1589.00 1667.30 1706.26 1708.93 3221.56 3229.27 3237.14 3242.88 3253.22 3274.16 3638.46 3691.63
frequency: 52.01 66.26 99.38 193.95 259.38 295.61 337.73 344.71 443.78 502.84 533.25 579.14 580.23 595.78 638.59 663.76 673.47 714.81 760.50 783.01 786.15 807.23 819.91 858.82 888.17 893.01 911.88 921.98 927.44 997.54 1022.12 1045.34 1050.91 1146.15 1159.22 1184.97 1227.39 1248.37 1268.85 1287.38 1335.74 1373.93 1390.27 1413.72 1502.89 1517.70 1527.97 1559.25 1589.00 1667.30 1706.26 1708.93 3221.56 3229.27 3237.14 3242.88 3253.22 3274.16 3638.46 3691.63
formula: C10H8N3S
InChI: InChI=1S/C10H8N3S/c1-2-4-8-7(3-1)12-10(13-8)9-5-14-6-11-9/h1-6,12-13H
22 atoms
C  1.889632 0.667008 0.000004
C  1.922145 -0.724375 0.000008
C  3.115964 -1.43073 0.000016
C  4.27156 -0.676633 0.000017
C  4.239718 0.725379 0.000008
C  3.051266 1.425939 0.000002
C  -0.207715 -0.074532 -0.000001
H  3.144188 -2.511597 0.000017
H  5.228851 -1.179627 0.00002
H  5.173302 1.271092 0.000008
H  3.028087 2.506768 -0.000004
H  0.276041 -2.095137 -0.000019
N  0.592089 -1.140895 -0.000006
N  0.545811 1.018759 0.000008
C  -1.654943 -0.021289 -0.000004
C  -2.538094 -1.061318 0.000035
H  -2.347971 -2.122709 0.000059
C  -3.496846 1.146219 -0.000019
H  -4.15349 2.004468 0.000019
S  -4.117588 -0.44955 -0.000049
N  -2.206069 1.230376 0.000006
H  0.136465 1.941712 0.000007
totalener: -948.17207760 hartree
nucrepener: 892.96510714 hartree
electener: -1841.13718474 hartree
oneelecener: -3049.87672937 hartree
twoeener: 1208.73954463 hartree
kineticenergy: 944.63155560 hartree
xcener: -72.759305807543 hartree
chargesum: 1.0000000
charge: 0.088688 0.097979 -0.117384 -0.085065 -0.091227 -0.110942 0.372670 0.144398 0.152780 0.152955 0.147613 0.173155 -0.126813 -0.085077 0.120330 -0.133442 0.124563 -0.001655 0.151826 0.194674 -0.362738 0.192713
charge: -0.105987 -0.105083 0.016052 0.024786 0.024719 0.020685 -0.122080 0.032629 0.036469 0.036588 0.034240 0.016375 0.431879 0.443865 -0.255095 -0.234337 0.004237 -0.315591 0.008624 0.838827 0.145113 0.023083
qa: 0.0887 0.0980 -0.1174 -0.0851 -0.0912 -0.1109 0.3727 0.1444 0.1528 0.1530 0.1476 0.1732 -0.1268 -0.0851 0.1203 -0.1334 0.1246 -0.0017 0.1518 0.1947 -0.3627 0.1927
va: 3.8461 3.8255 4.0287 3.9872 3.9848 4.0263 3.8679 1.0041 0.9960 0.9961 1.0028 1.0144 3.5667 3.5236 3.6641 4.0598 1.0149 4.0754 0.9988 2.8553 3.0279 1.0210
dispcorr: -0.007351156 hartree
energy: -948.182150143542
dipole: 10.29040 -10.23519 0.05521 -0.17788 -0.42378 -0.60167 0.00012 -0.00013 -0.00000
magnitude: 0.60419 au
magnitude: 1.53574 debye
temp: 298.15 k
press: 1.00 atm
zeropoint: 0.17007045 hartree
thermalvibcorrection: 0.00731017 hartree
thermalrotcorrection: 0.00141627 hartree
thermaltrasncorrection: 0.00141627 hartree
thermaltotal: -948.00193699 hartree
thermalcorr: 0.01014271 hartree
nonthermalcorr: 0.17007045 hartree
totalcorr: 0.18021315 hartree
thermalcorrenthalpy: 0.00094421 hartree
totalenthalpy: -948.00099278 hartree
totalentropycorr: -0.04703477 hartree
gibbsenthalpy: -948.04802755 hartree
gibbsminuselec: 0.13412259 hartree
