program: Orca
programVersion: 5.0.2
elementType: C C C C C C H H H H N N N C C C C H C C H H S O C H H H O C H H H H
charge: 1
multiplicity: 1
keywords: wB97X-D3 TightOpt Freq def2-TZVPP def2/J RIJCOSX TightSCF defgrid3 CHELPG
frequency: 0.00 0.00 0.00 0.00 0.00 0.00 33.28 41.96 54.09 84.38 98.00 115.37 148.66 163.86 201.94 214.52 219.45 250.45 260.61 278.12 292.80 336.66 345.16 384.49 412.71 427.89 458.04 488.78 497.30 570.30 594.03 601.77 638.13 645.46 650.36 676.27 702.42 711.65 737.48 773.63 796.54 805.31 840.50 850.16 870.22 902.11 928.56 943.41 957.92 971.39 981.01 981.13 1025.59 1026.56 1066.03 1068.38 1112.62 1138.00 1155.46 1168.09 1173.33 1179.63 1216.67 1233.71 1250.12 1278.23 1298.81 1313.41 1343.58 1348.28 1351.16 1388.86 1421.19 1448.49 1468.95 1473.78 1483.53 1501.05 1501.46 1514.92 1522.01 1531.36 1578.47 1586.41 1642.36 1683.75 1698.40 1731.74 3069.29 3072.49 3154.31 3181.87 3184.76 3191.08 3214.00 3226.77 3229.92 3238.79 3251.22 3264.15 3618.93 3624.62
frequency: 33.28 41.96 54.09 84.38 98.00 115.37 148.66 163.86 201.94 214.52 219.45 250.45 260.61 278.12 292.80 336.66 345.16 384.49 412.71 427.89 458.04 488.78 497.30 570.30 594.03 601.77 638.13 645.46 650.36 676.27 702.42 711.65 737.48 773.63 796.54 805.31 840.50 850.16 870.22 902.11 928.56 943.41 957.92 971.39 981.01 981.13 1025.59 1026.56 1066.03 1068.38 1112.62 1138.00 1155.46 1168.09 1173.33 1179.63 1216.67 1233.71 1250.12 1278.23 1298.81 1313.41 1343.58 1348.28 1351.16 1388.86 1421.19 1448.49 1468.95 1473.78 1483.53 1501.05 1501.46 1514.92 1522.01 1531.36 1578.47 1586.41 1642.36 1683.75 1698.40 1731.74 3069.29 3072.49 3154.31 3181.87 3184.76 3191.08 3214.00 3226.77 3229.92 3238.79 3251.22 3264.15 3618.93 3624.62
formula: C14H14N3O2S
InChI: InChI=1S/C14H14N3O2S/c1-19-12-8-9(20(2)18)5-6-10(12)13-16-11-4-3-7-15-14(11)17-13/h3-8,15-16H,1-2H3
34 atoms
C  3.378763 -0.889045 -0.03279
C  3.4193 0.517801 0.07131
C  4.610909 1.191006 0.157582
C  5.779704 0.417479 0.137097
C  5.71737 -0.949001 0.034918
C  1.363984 -0.277829 -0.052076
H  4.663713 2.268684 0.237866
H  6.74848 0.889484 0.201437
H  6.595386 -1.576986 0.015826
H  1.664675 1.777071 0.106796
N  2.093686 0.865235 0.055155
N  2.136306 -1.36492 -0.106567
N  4.527695 -1.582022 -0.048012
C  -0.085237 -0.316108 -0.103155
C  -0.701119 -1.566906 -0.227862
C  -0.886631 0.84029 -0.046258
C  -2.070025 -1.684966 -0.296163
H  -0.070573 -2.443694 -0.278366
C  -2.268274 0.720765 -0.109666
C  -2.838874 -0.530016 -0.223152
H  -2.529889 -2.657331 -0.416317
H  -2.93161 1.575031 -0.081685
S  -4.634991 -0.572767 -0.374683
O  -5.083094 0.831831 -0.335758
C  -4.953311 -1.270938 1.252512
H  -6.035327 -1.33999 1.346009
H  -4.512352 -2.264049 1.32415
H  -4.550443 -0.603289 2.011875
O  -0.263506 2.0344 0.066574
C  -1.058361 3.219924 0.106179
H  -1.64061 3.323731 -0.809271
H  -1.719121 3.211727 0.972955
H  -0.357672 4.045052 0.189314
H  4.484228 -2.589085 -0.123711
totalener: -1254.66338009 hartree
nucrepener: 1597.76498044 hartree
electener: -2852.42836053 hartree
oneelecener: -4868.13424869 hartree
twoeener: 2015.70588815 hartree
kineticenergy: 1249.53218105 hartree
xcener: -101.227849819472 hartree
chargesum: 1.0000000
charge: 0.266781 0.037468 -0.056696 -0.082921 0.023216 0.446610 0.156088 0.161046 0.169223 0.184323 -0.120685 -0.341476 -0.093160 -0.160065 -0.089707 0.279297 -0.139316 0.143662 -0.188527 -0.037890 0.128370 0.148991 0.527882 -0.535828 -0.285328 0.140607 0.110158 0.123372 -0.349457 -0.129700 0.131155 0.126902 0.106973 0.198633
charge: -0.203745 -0.121086 0.069191 0.004692 0.011881 -0.146680 0.044160 0.041294 0.038611 -0.025719 0.416413 0.157160 0.437001 -0.079598 0.046607 -0.170386 -0.029265 0.036764 -0.023034 -0.240334 0.028574 0.024321 0.818321 -0.366126 -0.139336 0.008486 0.001956 0.002893 0.290961 -0.019897 0.017100 0.015936 0.014106 0.038777
qa: 0.2668 0.0375 -0.0567 -0.0829 0.0232 0.4466 0.1561 0.1610 0.1692 0.1843 -0.1207 -0.3415 -0.0932 -0.1601 -0.0897 0.2793 -0.1393 0.1437 -0.1885 -0.0379 0.1284 0.1490 0.5279 -0.5358 -0.2853 0.1406 0.1102 0.1234 -0.3495 -0.1297 0.1312 0.1269 0.1070 0.1986
va: 4.0261 3.9058 4.0048 3.9389 3.9562 3.7684 0.9998 0.9958 0.9930 1.0455 3.4570 3.0489 3.5154 3.7626 4.0136 3.9045 4.0081 1.0267 3.9213 3.9718 1.0136 1.0514 3.7006 1.8973 3.9288 1.0069 1.0195 1.0089 2.0608 3.8677 0.9851 0.9861 0.9987 0.9968
dispcorr: -0.013962680 hartree
energy: -1254.682324327181
dipole: -0.13709 5.49474 5.35765 3.66634 -4.01017 -0.34383 4.63851 -3.92581 0.71270
magnitude: 5.41577 au
magnitude: 13.76580 debye
temp: 298.15 k
press: 1.00 atm
zeropoint: 0.26970054 hartree
thermalvibcorrection: 0.01437394 hartree
thermalrotcorrection: 0.00141627 hartree
thermaltrasncorrection: 0.00141627 hartree
thermaltotal: -1254.39541730 hartree
thermalcorr: 0.01720648 hartree
nonthermalcorr: 0.26970054 hartree
totalcorr: 0.28690702 hartree
thermalcorrenthalpy: 0.00094421 hartree
totalenthalpy: -1254.39447309 hartree
totalentropycorr: -0.06160893 hartree
gibbsenthalpy: -1254.45608203 hartree
gibbsminuselec: 0.22624230 hartree
