program: Orca
programVersion: 5.0.2
elementType: O O O O O O O O O N N C C C C C C C C C C C C C C C C C C C C C C C C C C C C C C C C C H H H H H H H H H H H H H H H H H H H H H H H H H H H H H H H H H H H H H H H H H
charge: 1
multiplicity: 1
keywords: wB97X-D3 TightOpt Freq def2-TZVPP def2/J RIJCOSX TightSCF defgrid3 CHELPG
frequency: 0.00 0.00 0.00 0.00 0.00 0.00 10.29 14.50 19.21 26.23 28.32 39.24 48.76 54.19 63.22 70.82 75.89 83.06 87.14 94.67 102.27 114.82 118.90 124.08 135.54 139.23 145.07 149.07 154.73 166.04 178.29 183.95 189.34 195.56 200.08 203.40 220.10 230.36 233.73 241.93 255.71 258.82 271.25 277.74 285.21 290.36 292.16 305.05 311.79 314.26 320.33 330.92 348.90 349.40 370.12 387.12 393.79 398.60 413.83 425.26 447.83 452.41 462.05 466.00 482.54 497.12 513.66 525.71 536.30 549.43 549.86 557.25 579.60 594.21 616.41 628.72 636.78 644.25 655.76 672.11 673.56 678.12 731.28 742.94 756.06 771.66 773.80 784.69 786.77 804.70 810.10 814.28 832.62 841.06 852.06 880.31 894.80 896.78 909.60 915.27 927.94 941.00 943.75 958.61 970.33 976.68 980.48 982.81 993.60 997.45 997.72 1018.61 1041.24 1050.75 1055.87 1071.36 1082.02 1084.85 1089.19 1097.40 1101.56 1124.90 1138.00 1144.69 1147.48 1157.07 1162.57 1173.70 1174.93 1177.42 1180.38 1181.13 1182.27 1183.34 1184.53 1187.20 1194.92 1201.06 1202.28 1204.38 1207.73 1217.21 1218.71 1225.86 1232.58 1232.96 1233.98 1244.96 1256.38 1265.72 1274.70 1275.89 1277.50 1299.68 1306.90 1316.35 1325.02 1328.23 1334.94 1341.72 1348.83 1350.28 1369.05 1370.35 1372.08 1378.99 1379.73 1387.61 1393.25 1396.48 1400.15 1409.33 1415.47 1419.37 1430.18 1434.41 1437.29 1441.07 1468.29 1475.31 1482.70 1486.34 1489.37 1491.03 1492.10 1492.33 1492.86 1493.50 1494.19 1495.56 1497.33 1500.29 1502.91 1503.63 1503.94 1506.91 1508.47 1510.03 1511.04 1512.40 1512.56 1518.98 1522.99 1524.27 1539.05 1566.41 1579.47 1624.48 1643.88 1651.13 1659.05 1675.33 1713.15 1821.06 2618.90 3001.26 3026.48 3038.61 3042.87 3044.54 3045.48 3054.64 3056.86 3067.13 3067.62 3075.48 3079.42 3083.31 3083.99 3084.86 3086.21 3087.27 3090.32 3092.62 3105.11 3115.23 3115.56 3117.14 3137.81 3140.46 3159.45 3167.57 3171.05 3178.47 3186.52 3186.53 3194.66 3202.14 3202.78 3205.04 3228.71 3230.41 3246.27 3260.23 3728.23
frequency: 10.29 14.50 19.21 26.23 28.32 39.24 48.76 54.19 63.22 70.82 75.89 83.06 87.14 94.67 102.27 114.82 118.90 124.08 135.54 139.23 145.07 149.07 154.73 166.04 178.29 183.95 189.34 195.56 200.08 203.40 220.10 230.36 233.73 241.93 255.71 258.82 271.25 277.74 285.21 290.36 292.16 305.05 311.79 314.26 320.33 330.92 348.90 349.40 370.12 387.12 393.79 398.60 413.83 425.26 447.83 452.41 462.05 466.00 482.54 497.12 513.66 525.71 536.30 549.43 549.86 557.25 579.60 594.21 616.41 628.72 636.78 644.25 655.76 672.11 673.56 678.12 731.28 742.94 756.06 771.66 773.80 784.69 786.77 804.70 810.10 814.28 832.62 841.06 852.06 880.31 894.80 896.78 909.60 915.27 927.94 941.00 943.75 958.61 970.33 976.68 980.48 982.81 993.60 997.45 997.72 1018.61 1041.24 1050.75 1055.87 1071.36 1082.02 1084.85 1089.19 1097.40 1101.56 1124.90 1138.00 1144.69 1147.48 1157.07 1162.57 1173.70 1174.93 1177.42 1180.38 1181.13 1182.27 1183.34 1184.53 1187.20 1194.92 1201.06 1202.28 1204.38 1207.73 1217.21 1218.71 1225.86 1232.58 1232.96 1233.98 1244.96 1256.38 1265.72 1274.70 1275.89 1277.50 1299.68 1306.90 1316.35 1325.02 1328.23 1334.94 1341.72 1348.83 1350.28 1369.05 1370.35 1372.08 1378.99 1379.73 1387.61 1393.25 1396.48 1400.15 1409.33 1415.47 1419.37 1430.18 1434.41 1437.29 1441.07 1468.29 1475.31 1482.70 1486.34 1489.37 1491.03 1492.10 1492.33 1492.86 1493.50 1494.19 1495.56 1497.33 1500.29 1502.91 1503.63 1503.94 1506.91 1508.47 1510.03 1511.04 1512.40 1512.56 1518.98 1522.99 1524.27 1539.05 1566.41 1579.47 1624.48 1643.88 1651.13 1659.05 1675.33 1713.15 1821.06 2618.90 3001.26 3026.48 3038.61 3042.87 3044.54 3045.48 3054.64 3056.86 3067.13 3067.62 3075.48 3079.42 3083.31 3083.99 3084.86 3086.21 3087.27 3090.32 3092.62 3105.11 3115.23 3115.56 3117.14 3137.81 3140.46 3159.45 3167.57 3171.05 3178.47 3186.52 3186.53 3194.66 3202.14 3202.78 3205.04 3228.71 3230.41 3246.27 3260.23 3728.23
formula: C33H41N2O9
InChI: InChI=1S/C33H41N2O9/c1-38-19-7-8-20-21-9-10-35-16-18-13-27(44-32(36)17-11-25(39-2)30(41-4)26(12-17)40-3)31(42-5)28(33(37)43-6)22(18)15-24(35)29(21)34-23(20)14-19/h7-8,11-12,14,18,22,24,27-28,31,34,36H,9-10,13,15-16H2,1-6H3
85 atoms
O  1.359485 2.87085 -0.011365
O  2.631763 0.27631 0.051309
O  -2.613148 3.342031 0.167455
O  -1.268401 3.258727 -1.61789
O  3.524745 2.111376 0.981646
O  -9.658992 0.264816 0.658798
O  8.42409 1.368865 0.701354
O  6.568938 -2.791569 -0.623502
O  8.746078 -1.154375 -0.142439
N  -1.97372 -2.288674 -0.376433
N  -4.997842 -0.15238 -0.807113
C  -1.629916 0.525406 0.259241
C  -0.891486 -0.570932 1.032428
C  -1.966037 0.048886 -1.154046
C  -0.820834 1.840215 0.285145
C  -2.707921 -1.28537 -1.156392
C  -1.700862 -1.860544 0.987343
C  0.532138 -0.758016 0.509456
C  0.6101 1.664654 -0.223532
C  1.283981 0.551885 0.565727
C  -4.130216 -1.220303 -0.672367
C  -2.690807 -3.564777 -0.395626
C  -4.753694 -2.235575 -0.020224
C  -4.064891 -3.524248 0.298077
C  -1.559115 2.900389 -0.505519
C  -6.088319 -1.788357 0.273601
C  -6.207741 -0.490562 -0.245224
C  1.764425 3.579311 -1.195424
C  -7.195069 -2.354432 0.919084
C  3.663089 0.950322 0.462242
C  -7.382618 0.260324 -0.15446
C  -8.35658 -1.632406 1.022127
C  -8.454886 -0.330975 0.487557
C  -3.440382 4.300018 -0.504076
C  4.959935 0.368949 0.315585
C  5.092784 -0.958293 -0.119359
C  6.087144 1.131805 0.622996
C  7.344168 0.589001 0.472615
C  6.344972 -1.513212 -0.264971
C  -9.838878 1.562849 0.146639
C  7.497388 -0.72694 -0.007392
C  9.222248 1.027104 1.83437
C  5.45695 -3.621548 -0.90035
C  9.142865 -2.069156 -1.171524
H  -2.569608 0.72288 0.780816
H  -0.831316 -0.265247 2.082714
H  -2.560566 0.798821 -1.679956
H  -1.060512 -0.074974 -1.750869
H  -0.768858 2.183186 1.322026
H  -2.70625 -1.643915 -2.191118
H  -2.620205 -1.696613 1.566961
H  -1.148886 -2.662987 1.482974
H  0.518696 -1.136227 -0.513527
H  1.060682 -1.494155 1.11688
H  0.618733 1.425307 -1.288849
H  1.405288 0.875223 1.604442
H  -2.820364 -3.84502 -1.44303
H  -2.054225 -4.32363 0.062918
H  -4.657191 -4.377526 -0.039576
H  -3.958356 -3.643521 1.381215
H  -4.832389 0.671127 -1.351955
H  2.431777 2.9594 -1.799506
H  0.8908 3.861357 -1.77556
H  2.294197 4.464934 -0.854614
H  -7.141548 -3.353948 1.332833
H  -7.441369 1.255653 -0.571161
H  -9.229664 -2.041242 1.512326
H  -2.874345 5.205421 -0.713852
H  -3.813856 3.887377 -1.439833
H  -4.257953 4.50961 0.177515
H  4.208258 -1.542624 -0.31898
H  6.000454 2.156338 0.95519
H  -9.149857 2.274736 0.61165
H  -9.705476 1.586176 -0.939103
H  -10.85987 1.847145 0.386461
H  8.622432 1.071613 2.746555
H  9.662032 0.036495 1.725517
H  10.00991 1.773274 1.882799
H  4.819611 -3.73113 -0.019564
H  4.871517 -3.231681 -1.73656
H  5.866444 -4.590449 -1.169088
H  10.200914 -1.87683 -1.323948
H  8.597841 -1.871088 -2.092947
H  8.986627 -3.097029 -0.858101
H  2.614767 2.512968 0.728718
totalener: -2068.67804633 hartree
nucrepener: 5412.59953492 hartree
electener: -7481.27758124 hartree
twoeener: 6081.20070871 hartree
kineticenergy: 2059.69417311 hartree
xcener: -197.323257162256 hartree
chargesum: 1.0000000
charge: -0.301078 -0.235554 -0.250412 -0.377926 -0.275970 -0.281434 -0.305018 -0.297854 -0.279396 -0.144493 -0.174712 0.023487 0.142023 -0.391835 0.017009 0.160679 -0.267000 -0.365060 0.032241 0.158908 0.011769 -0.134332 -0.146585 -0.075674 0.288219 -0.023413 -0.004695 -0.157928 -0.129135 0.554498 -0.161748 -0.151313 0.266226 -0.132776 -0.122036 -0.184498 -0.125575 0.114029 0.256636 -0.128245 0.222723 -0.103944 -0.138809 -0.121748 0.118422 0.092105 0.100127 0.104070 0.108113 0.091845 0.121956 0.094666 0.114312 0.096510 0.130234 0.137006 0.092555 0.090533 0.092310 0.086843 0.120766 0.110558 0.154547 0.133457 0.118955 0.080635 0.121075 0.122577 0.107052 0.134779 0.126076 0.139261 0.090819 0.097085 0.122815 0.093772 0.110123 0.125415 0.106600 0.109690 0.126959 0.128041 0.115670 0.118226 0.255187
charge: 0.317751 0.372758 0.309973 0.124686 0.430593 0.289035 0.277277 0.300954 0.323919 0.199084 0.373318 -0.046411 -0.062252 0.003456 -0.053900 -0.125737 -0.061070 0.002972 -0.135850 -0.099892 -0.131155 -0.062352 -0.089687 -0.019064 -0.446505 -0.085371 -0.117074 -0.027491 0.002514 -0.290266 -0.040247 -0.014372 -0.209516 -0.016055 -0.117663 0.017144 0.048210 -0.215318 -0.205898 -0.063031 -0.170886 -0.035004 -0.040051 -0.015679 0.046318 0.039048 0.026371 0.025572 0.051408 0.038916 0.024292 0.026937 0.033465 0.033526 0.039040 0.038638 0.024887 0.018549 0.029805 0.021952 -0.032381 0.003228 0.008879 0.015805 0.023275 0.008749 0.024082 0.013056 0.007553 0.013894 0.024248 0.040105 0.001463 0.003273 0.013417 0.002245 0.000793 0.014955 0.008376 0.008115 0.019175 0.015311 0.010681 0.005833 -0.168697
qa: -0.3011 -0.2356 -0.2504 -0.3779 -0.2760 -0.2814 -0.3050 -0.2979 -0.2794 -0.1445 -0.1747 0.0235 0.1420 -0.3918 0.0170 0.1607 -0.2670 -0.3651 0.0322 0.1589 0.0118 -0.1343 -0.1466 -0.0757 0.2882 -0.0234 -0.0047 -0.1579 -0.1291 0.5545 -0.1617 -0.1513 0.2662 -0.1328 -0.1220 -0.1845 -0.1256 0.1140 0.2566 -0.1282 0.2227 -0.1039 -0.1388 -0.1217 0.1184 0.0921 0.1001 0.1041 0.1081 0.0918 0.1220 0.0947 0.1143 0.0965 0.1302 0.1370 0.0926 0.0905 0.0923 0.0868 0.1208 0.1106 0.1545 0.1335 0.1190 0.0806 0.1211 0.1226 0.1071 0.1348 0.1261 0.1393 0.0908 0.0971 0.1228 0.0938 0.1101 0.1254 0.1066 0.1097 0.1270 0.1280 0.1157 0.1182 0.2552
va: 2.0811 2.2361 2.1659 2.0952 2.2794 2.1167 2.0491 2.1030 2.1367 2.8536 3.3786 3.8583 3.7724 4.0004 3.9142 4.0564 4.1195 4.0398 3.8999 3.7016 3.7335 3.9922 3.7604 3.7910 4.2325 3.8589 4.0878 3.8408 4.0046 3.9470 3.9597 3.9721 3.9357 3.8745 3.8346 3.9579 4.1246 4.0448 3.8356 3.8951 3.9204 3.8465 3.8897 3.8568 1.0329 1.0144 1.0239 1.0117 1.0388 0.9909 0.9987 1.0031 1.0284 1.0261 0.9982 1.0092 1.0011 0.9993 1.0066 0.9972 1.0406 0.9856 1.0027 0.9899 1.0065 1.0332 1.0182 0.9962 0.9938 0.9921 1.0267 1.0269 0.9882 0.9879 0.9987 0.9921 0.9934 0.9940 0.9862 0.9857 0.9985 0.9933 0.9932 0.9914 1.0993
dispcorr: -0.049000560 hartree
energy: -2068.727046700659
dipole: -3.18049 7.72534 4.54485 -4.24387 4.97182 0.72795 -2.60194 2.41292 -0.18903
magnitude: 4.60666 au
magnitude: 11.70919 debye
temp: 298.15 k
press: 1.00 atm
zeropoint: 0.71932480 hartree
thermalvibcorrection: 0.03869009 hartree
thermalrotcorrection: 0.00141627 hartree
thermaltrasncorrection: 0.00141627 hartree
thermaltotal: -2067.96619928 hartree
thermalcorr: 0.04152263 hartree
nonthermalcorr: 0.71932480 hartree
totalcorr: 0.76084743 hartree
thermalcorrenthalpy: 0.00094421 hartree
totalenthalpy: -2067.96525507 hartree
totalentropycorr: -0.11020082 hartree
gibbsenthalpy: -2068.07545589 hartree
gibbsminuselec: 0.65159081 hartree
