program: Gaussian 09
title: 000005253
version: EM64L-G09RevD.01
frameworkgroup: C1[X(C12H20N2O3S)]
method: RPBEPBE
basis: SDD
operation: Freq
keyword: #p
keyword: freq=noraman
keyword: PBEPBE/SDD
title: #p freq=noraman PBEPBE/SDD
converged: YES YES NO NO
title: Mulliken charges:
elementType: S O O O N N C C C C C C C C C C C C H H H H H H H H H H H H H H H H H H H H
charge: 1.006296 -0.475955 -0.544194 -0.527723 -0.393805 -0.559346 -0.182571 -0.433755 -0.035789 0.440407 -0.403820 -0.382862 -0.659887 -0.708707 0.350051 -0.346989 -0.380005 -0.752956 0.204606 0.224245 0.232115 0.201105 0.275122 0.234667 0.292629 0.211617 0.218959 0.220578 0.211581 0.223309 0.224750 0.290042 0.226207 0.364477 0.293907 0.294286 0.282129 0.265279
chargesum: 0.00000
title: Mulliken charges with hydrogens summed into heavy atoms:
elementType: S O O O N N C C C C C C C C C C C C
charge: 1.006296 -0.111477 -0.544194 -0.527723 -0.118683 -0.265439 0.022035 0.022605 0.165316 0.440407 -0.169152 -0.090233 -0.008734 -0.049067 0.350051 -0.056947 -0.153799 0.088738
polarizability: 2.90453146e+02 -2.13476977e+01 1.46849982e+02 7.85943495e+00 1.14987959e+00 1.63865496e+02
1716.lowfreq: -11.1188 -5.8046 -4.6562 -0.0015 -0.0014 0.0014 14.6993 21.0911 28.9720
frequency: 14.3424 20.8176 28.9443 39.8966 57.2364 58.9946 73.1468 117.1783 139.9939 146.3950 155.9737 192.9795 196.9919 206.7183 221.7112 242.9584 247.8040 255.4132 303.7352 327.8749 355.5561 373.7239 381.8000 388.1594 408.6885 420.8102 434.5335 478.4182 518.5843 539.6562 548.2608 589.7809 630.5744 655.1934 723.4278 766.0747 783.7746 794.8592 815.9291 819.5708 826.8650 841.5733 852.3855 882.5980 899.7493 916.7354 938.2519 952.7666 956.9538 963.9758 982.6216 1006.4389 1014.6493 1025.7011 1049.2655 1080.1715 1109.7086 1128.5630 1146.3144 1173.2923 1178.7384 1207.2044 1221.4411 1228.4397 1238.7471 1260.7475 1286.5481 1288.6616 1302.2477 1321.0425 1332.7503 1350.0395 1378.8291 1388.4456 1393.5823 1397.8394 1406.7992 1415.8811 1418.2848 1444.0260 1455.1260 1466.0583 1474.8131 1479.4977 1488.5434 1493.1606 1571.2183 1611.2026 2898.6868 2900.5804 2953.7025 2976.3354 2983.5071 3030.1924 3063.2999 3068.8659 3081.4801 3084.8110 3092.6562 3116.1251 3121.0102 3171.2887 3173.9099 3181.2021 3184.8513 3208.3540 3394.5036 3434.9198
redmass: 4.0970 5.0396 4.3285 2.8829 4.7677 3.5059 4.7645 3.4983 2.9254 1.2124 9.1894 4.6071 3.1881 1.4744 2.3198 3.3137 1.2330 4.4620 3.5410 6.8563 3.1683 5.6931 5.7627 3.2404 2.8982 2.3899 2.3020 2.9315 3.3831 2.8929 8.1523 3.3902 6.2665 1.4088 3.2672 2.0656 1.8505 1.3280 2.9295 6.5439 2.8193 1.2969 1.9277 2.7567 2.1468 1.1978 1.7649 1.5757 1.3275 1.3700 1.3590 2.7662 2.4006 3.1977 2.9679 3.0358 1.3999 1.8310 1.8546 1.3659 1.7233 2.0020 1.3578 1.8727 2.0334 1.1974 1.1367 1.2271 1.2121 1.2245 1.3997 1.3185 1.2408 3.8518 1.2169 1.6238 1.0743 1.2013 2.1542 1.2085 1.0788 1.0485 1.1000 1.0569 1.0572 2.6042 6.6356 6.1847 1.0833 1.0826 1.0671 1.0363 1.0358 1.0239 1.0951 1.0993 1.0991 1.1001 1.0991 1.0901 1.0899 1.0942 1.0948 1.1074 1.1081 1.0630 1.0757 1.0745
irintensity: 2.5382 1.4500 3.0513 0.7598 11.4562 1.1684 1.6599 0.4899 2.9382 0.0076 4.2721 0.6574 2.2556 2.0239 11.8670 7.6689 1.3892 2.4219 4.9943 19.3284 5.6780 52.3787 5.5756 2.2275 8.7683 17.7681 7.6485 3.3275 6.5870 2.5381 64.5882 15.1417 3.7510 21.6718 2.1432 72.8686 41.2889 103.4299 12.8090 123.1799 22.2685 5.4260 48.7894 16.0318 17.5287 3.9244 4.3153 2.8724 116.8429 1.5174 2.4278 9.4599 48.4683 18.4540 60.7572 18.1339 20.8632 5.7554 71.9747 2.7488 51.3451 15.7764 11.6273 5.0899 5.8626 19.4744 4.7199 13.6303 14.2043 8.9453 20.2555 19.4233 20.6901 16.8695 30.0348 57.3402 7.6387 17.1512 2.6549 26.3140 3.3560 0.6766 9.2908 9.4282 13.5363 41.8911 1.0955 8.4601 66.9794 50.9995 48.1454 35.5295 12.7454 0.5457 14.5895 35.5850 36.9144 22.5708 59.2169 17.5586 13.5721 1.3903 0.5039 0.0832 0.7436 238.5567 13.5209 0.2960
temp: 298.150 k
press: 1.00000 atm
elementType: 16 8 8 8 7 7 6 6 6 6 6 6 6 6 6 6 6 6 1 1 1 1 1 1 1 1 1 1 1 1 1 1 1 1 1 1 1 1
symmnumber: 1
zpe: 806553.8 jmol-1
zpe.correction: 0.307200 hartree
zpe.thermalcorrener: 0.328201 hartree
zpe.thermalcorrenthalpy: 0.329145 hartree
zpe.thermalcorrgfe: 0.254308 hartree
zpe.sumelectzpe: -1200.918097 hartree
zpe.sumelectthermal: -1200.897096 hartree
zpe.sumelectthermalent: -1200.896152 hartree
zpe.sumelectthermalfe: -1200.970989 hartree
dipole: 7.7785 3.5533 -1.1824
dipole: 8.6330
quadrupole: -139.7670 -117.8742 -113.3179
quadrupole: 4.7930 20.0825 -5.1002
quadrupole: -16.1140 5.7789 10.3351 4.7930 20.0825 -5.1002
hfenergy: -1201.2252971 hartree
pointgroup: C01 [X(C12H20N2O3S1)]
dipole: -3.0833345 1.4167967 0.1477868 debye
polarizability: 289.6563334|24.4927252|147.7225211|5.2557105|2.5126566|163.7897699 unknown
InChI: InChI=1S/C12H20N2O3S/c1-9(2)13-8-12(15)10-4-6-11(7-5-10)14-18(3,16)17/h4-7,9,12-15H,8H2,1-3H3
charge 0 multiplicity 1
38 atoms
S  4.603807 0.853867 -0.130532
O  -2.66282 -1.452795 1.150158
O  6.040905 0.933686 0.621151
O  4.474008 0.727295 -1.740654
N  -4.077432 -0.007868 -0.591371
N  3.732497 -0.699534 0.632159
C  -1.981979 -1.223252 -0.116026
C  -2.604722 0.06669 -0.752878
C  -4.817213 1.281082 -0.41245
C  -0.484766 -1.085345 0.098691
C  0.401498 -1.120323 -1.010784
C  0.048103 -0.906228 1.398351
C  -4.602505 1.832328 1.01338
C  -6.312862 1.029436 -0.689916
C  2.320652 -0.782788 0.470364
C  1.790617 -0.979137 -0.836871
C  1.434203 -0.730629 1.583643
C  3.561078 2.395505 0.379369
H  -2.170129 -2.07641 -0.809641
H  -2.273458 0.178589 -1.807216
H  -2.237696 0.942519 -0.189721
H  -4.449506 2.040759 -1.142587
H  -4.512503 -0.585525 -1.324356
H  0.005962 -1.288985 -2.020308
H  -0.643651 -0.912751 2.245204
H  -5.100916 2.812505 1.124869
H  -5.024166 1.133747 1.758552
H  -3.531436 1.970096 1.245185
H  -6.480481 0.687694 -1.729447
H  -6.895783 1.955002 -0.54158
H  -6.706007 0.258625 -0.001572
H  2.479994 -1.037256 -1.684381
H  1.838618 -0.58361 2.593912
H  -3.589608 -1.089231 0.967382
H  4.068358 -0.717823 1.612028
H  4.00734 3.232605 -0.175064
H  2.527141 2.190895 0.069918
H  3.673657 2.503467 1.466636
