program: Orca
programVersion: 5.0.2
elementType: O O O O O O O O O N N C C C C C C C C C C C C C C C C C C C C C C C C C C C C C C C C C H H H H H H H H H H H H H H H H H H H H H H H H H H H H H H H H H H H H H H H H H
charge: 1
multiplicity: 1
keywords: wB97X-D3 TightOpt Freq def2-TZVPP def2/J RIJCOSX TightSCF defgrid3 CHELPG
frequency: 0.00 0.00 0.00 0.00 0.00 0.00 9.35 13.45 16.41 22.20 27.14 31.76 48.13 50.06 54.80 60.02 65.44 66.48 82.11 85.34 90.97 96.16 105.50 116.35 128.18 137.58 146.67 150.87 155.49 158.80 172.48 180.14 188.99 195.31 202.09 206.92 216.47 229.70 232.43 241.78 243.12 250.15 260.79 268.19 274.54 284.09 290.29 299.45 301.81 312.13 321.50 332.16 343.59 355.84 361.97 379.61 384.29 421.09 424.94 430.15 452.81 453.62 462.19 466.10 473.07 500.48 515.96 530.89 533.76 539.99 553.04 559.94 574.36 601.54 617.06 631.09 639.51 646.07 656.88 669.40 681.77 693.83 735.62 753.63 759.89 761.67 773.50 784.62 794.96 806.15 806.65 824.25 834.05 844.12 855.44 868.38 882.31 894.12 903.62 914.82 928.27 935.28 939.15 951.96 967.75 976.20 981.87 985.65 997.97 1009.68 1022.31 1029.97 1033.50 1061.78 1068.88 1079.68 1081.49 1084.11 1093.46 1095.04 1102.74 1115.93 1133.92 1136.69 1147.08 1155.74 1161.31 1174.25 1176.33 1178.45 1180.08 1182.92 1183.17 1183.41 1187.18 1190.45 1198.18 1201.00 1206.15 1208.71 1216.56 1217.00 1225.70 1231.76 1232.48 1235.62 1246.36 1256.50 1266.44 1268.33 1270.35 1275.41 1279.11 1292.80 1299.93 1304.70 1312.03 1319.09 1330.13 1330.75 1342.12 1350.09 1355.11 1359.81 1370.41 1378.65 1386.86 1400.04 1403.63 1407.33 1414.53 1417.34 1423.01 1427.63 1430.38 1437.24 1438.47 1458.11 1461.32 1466.04 1476.54 1484.37 1487.71 1489.09 1490.54 1493.57 1493.82 1494.06 1495.34 1496.90 1498.62 1500.50 1501.51 1502.10 1502.61 1506.93 1509.24 1511.77 1511.97 1513.82 1515.28 1516.14 1517.85 1518.44 1526.79 1561.87 1576.40 1643.90 1662.87 1675.04 1679.23 1715.25 1813.66 1815.16 3030.18 3033.52 3034.42 3035.80 3038.19 3050.47 3054.76 3056.91 3058.27 3064.10 3075.75 3083.99 3091.22 3099.16 3099.97 3100.59 3102.12 3104.26 3105.53 3110.05 3111.78 3127.78 3141.18 3143.53 3146.27 3160.60 3166.16 3167.36 3170.02 3174.79 3175.97 3177.73 3181.20 3204.26 3205.99 3233.18 3238.68 3243.06 3264.33 3501.29 3715.11
frequency: 9.35 13.45 16.41 22.20 27.14 31.76 48.13 50.06 54.80 60.02 65.44 66.48 82.11 85.34 90.97 96.16 105.50 116.35 128.18 137.58 146.67 150.87 155.49 158.80 172.48 180.14 188.99 195.31 202.09 206.92 216.47 229.70 232.43 241.78 243.12 250.15 260.79 268.19 274.54 284.09 290.29 299.45 301.81 312.13 321.50 332.16 343.59 355.84 361.97 379.61 384.29 421.09 424.94 430.15 452.81 453.62 462.19 466.10 473.07 500.48 515.96 530.89 533.76 539.99 553.04 559.94 574.36 601.54 617.06 631.09 639.51 646.07 656.88 669.40 681.77 693.83 735.62 753.63 759.89 761.67 773.50 784.62 794.96 806.15 806.65 824.25 834.05 844.12 855.44 868.38 882.31 894.12 903.62 914.82 928.27 935.28 939.15 951.96 967.75 976.20 981.87 985.65 997.97 1009.68 1022.31 1029.97 1033.50 1061.78 1068.88 1079.68 1081.49 1084.11 1093.46 1095.04 1102.74 1115.93 1133.92 1136.69 1147.08 1155.74 1161.31 1174.25 1176.33 1178.45 1180.08 1182.92 1183.17 1183.41 1187.18 1190.45 1198.18 1201.00 1206.15 1208.71 1216.56 1217.00 1225.70 1231.76 1232.48 1235.62 1246.36 1256.50 1266.44 1268.33 1270.35 1275.41 1279.11 1292.80 1299.93 1304.70 1312.03 1319.09 1330.13 1330.75 1342.12 1350.09 1355.11 1359.81 1370.41 1378.65 1386.86 1400.04 1403.63 1407.33 1414.53 1417.34 1423.01 1427.63 1430.38 1437.24 1438.47 1458.11 1461.32 1466.04 1476.54 1484.37 1487.71 1489.09 1490.54 1493.57 1493.82 1494.06 1495.34 1496.90 1498.62 1500.50 1501.51 1502.10 1502.61 1506.93 1509.24 1511.77 1511.97 1513.82 1515.28 1516.14 1517.85 1518.44 1526.79 1561.87 1576.40 1643.90 1662.87 1675.04 1679.23 1715.25 1813.66 1815.16 3030.18 3033.52 3034.42 3035.80 3038.19 3050.47 3054.76 3056.91 3058.27 3064.10 3075.75 3083.99 3091.22 3099.16 3099.97 3100.59 3102.12 3104.26 3105.53 3110.05 3111.78 3127.78 3141.18 3143.53 3146.27 3160.60 3166.16 3167.36 3170.02 3174.79 3175.97 3177.73 3181.20 3204.26 3205.99 3233.18 3238.68 3243.06 3264.33 3501.29 3715.11
formula: C33H41N2O9
InChI: InChI=1S/C33H41N2O9/c1-38-19-7-8-20-21-9-10-35-16-18-13-27(44-32(36)17-11-25(39-2)30(41-4)26(12-17)40-3)31(42-5)28(33(37)43-6)22(18)15-24(35)29(21)34-23(20)14-19/h7-8,11-12,14,18,22,24,27-28,31,34-35H,9-10,13,15-16H2,1-6H3
85 atoms
O  -1.213219 2.672103 -1.00842
O  -2.565268 0.182504 -0.485147
O  2.045462 3.587684 -1.304645
O  1.46861 3.155695 0.813368
O  -3.137218 -1.244685 -2.112986
O  9.634964 0.417391 -0.237373
O  -7.938192 -2.217886 -1.177207
O  -6.75233 0.971106 2.152888
O  -8.610667 -0.643579 1.06888
N  2.030863 -2.298992 0.716304
N  4.901267 0.039056 0.949946
C  1.673499 0.346099 -0.5042
C  0.99247 -0.900852 -1.083841
C  1.863185 0.175677 1.004664
C  0.861957 1.587618 -0.906777
C  2.657931 -1.074675 1.359202
C  1.804996 -2.142833 -0.760302
C  -0.467646 -1.00662 -0.645351
C  -0.607358 1.521892 -0.481992
C  -1.249242 0.248433 -1.022628
C  4.094506 -1.075555 0.955402
C  2.814058 -3.544215 1.041734
C  4.804586 -2.160733 0.545644
C  4.201696 -3.520467 0.414503
C  1.474997 2.859332 -0.355513
C  6.135306 -1.706798 0.262104
C  6.161575 -0.332995 0.539108
C  -2.222447 3.265344 -0.214467
C  7.310191 -2.326656 -0.190408
C  -3.4528 -0.598333 -1.148839
C  7.308621 0.451572 0.395633
C  8.44283 -1.574814 -0.34071
C  8.449426 -0.190708 -0.047952
C  2.62542 4.828155 -0.885621
C  -4.804689 -0.559523 -0.54674
C  -5.097246 0.255377 0.547623
C  -5.778545 -1.357971 -1.111133
C  -7.071552 -1.360744 -0.595866
C  -6.37772 0.25437 1.06936
C  9.738376 1.796385 0.045585
C  -7.383201 -0.55359 0.501176
C  -9.286885 -1.828765 -1.397536
C  -5.784613 1.772465 2.791563
C  -9.424168 0.525046 1.061246
H  2.664434 0.436274 -0.960562
H  1.00695 -0.82313 -2.174586
H  2.368405 1.038852 1.435029
H  0.901903 0.138797 1.519765
H  0.881528 1.660944 -1.995788
H  2.563108 -1.253258 2.434566
H  2.787994 -2.088597 -1.221296
H  1.304974 -3.051962 -1.094837
H  -0.564307 -1.14114 0.438021
H  -0.943817 -1.864772 -1.119672
H  -0.679267 1.530338 0.613079
H  -1.317193 0.325647 -2.110554
H  2.87879 -3.58048 2.128883
H  2.22199 -4.391557 0.699224
H  4.803325 -4.270509 0.930974
H  4.160832 -3.837708 -0.631124
H  4.647954 0.952904 1.275035
H  -3.120991 2.646797 -0.174356
H  -1.857713 3.450093 0.801138
H  -2.465123 4.216772 -0.681528
H  7.329935 -3.385542 -0.416315
H  7.295426 1.507084 0.624429
H  9.367893 -2.017057 -0.684139
H  1.865216 5.46325 -0.435271
H  3.41983 4.65201 -0.162232
H  3.021988 5.285794 -1.785792
H  -4.321792 0.860834 0.988241
H  -5.55247 -1.983979 -1.962429
H  9.069925 2.382567 -0.590997
H  9.518792 2.002143 1.096725
H  10.767087 2.072587 -0.166048
H  -9.899906 -1.992351 -0.513847
H  -9.344833 -0.78012 -1.698659
H  -9.64477 -2.450641 -2.214833
H  -4.954922 1.168263 3.168522
H  -5.397993 2.543324 2.118969
H  -6.290005 2.247359 3.627822
H  -10.400346 0.214397 1.424893
H  -9.524589 0.916163 0.045303
H  -9.01788 1.296899 1.711897
H  1.113451 -2.405755 1.144666
totalener: -2068.69747985 hartree
nucrepener: 5409.57402065 hartree
electener: -7478.27150050 hartree
twoeener: 6078.18410897 hartree
kineticenergy: 2059.71417983 hartree
xcener: -197.318647679266 hartree
chargesum: 1.0000000
charge: -0.335331 -0.294803 -0.248591 -0.384949 -0.375995 -0.271974 -0.299061 -0.297055 -0.320232 0.243468 -0.166029 0.099304 0.093710 -0.457631 0.072115 0.103062 -0.298442 -0.410077 0.079777 0.165709 -0.003930 -0.170630 -0.129079 -0.090460 0.260790 -0.028476 -0.008062 -0.120140 -0.123203 0.446759 -0.149688 -0.141424 0.269651 -0.127711 -0.042486 -0.265676 -0.183486 0.185666 0.295112 -0.130735 0.120958 -0.122837 -0.133692 -0.115804 0.123638 0.110616 0.125697 0.132008 0.094824 0.134626 0.170143 0.151267 0.093722 0.138863 0.086177 0.100967 0.148011 0.144626 0.115368 0.109677 0.136783 0.091071 0.090684 0.123492 0.124093 0.096767 0.131199 0.121302 0.101965 0.131719 0.103476 0.130690 0.098757 0.102172 0.128713 0.113885 0.091370 0.119394 0.098507 0.094718 0.124961 0.122672 0.084787 0.121253 0.146948
charge: 0.248435 0.308814 0.308606 0.113919 0.121551 0.300359 0.286662 0.297889 0.280513 0.474261 0.388622 -0.045090 -0.061950 0.008166 -0.052084 -0.047451 0.032587 -0.004708 -0.179676 -0.142177 -0.147412 0.029378 -0.091891 -0.006755 -0.443792 -0.085707 -0.109183 -0.067490 0.005948 -0.411190 -0.029650 0.001028 -0.204439 -0.017373 -0.105775 -0.023151 0.027386 -0.209453 -0.201888 -0.050028 -0.204509 -0.044143 -0.055612 -0.049239 0.044023 0.053994 0.036071 0.030664 0.052847 0.044951 0.042231 0.038111 0.016467 0.034011 0.027537 0.037258 0.037304 0.032759 0.046122 0.033176 -0.018561 -0.003858 0.001313 0.013114 0.025205 0.014158 0.029562 0.013518 0.005700 0.012833 0.009843 0.035524 0.004398 0.005479 0.016651 0.002163 0.002544 0.010104 0.005262 0.003603 0.015061 0.011991 -0.000935 -0.002460 0.037953
qa: -0.3353 -0.2948 -0.2486 -0.3849 -0.3760 -0.2720 -0.2991 -0.2971 -0.3202 0.2435 -0.1660 0.0993 0.0937 -0.4576 0.0721 0.1031 -0.2984 -0.4101 0.0798 0.1657 -0.0039 -0.1706 -0.1291 -0.0905 0.2608 -0.0285 -0.0081 -0.1201 -0.1232 0.4468 -0.1497 -0.1414 0.2697 -0.1277 -0.0425 -0.2657 -0.1835 0.1857 0.2951 -0.1307 0.1210 -0.1228 -0.1337 -0.1158 0.1236 0.1106 0.1257 0.1320 0.0948 0.1346 0.1701 0.1513 0.0937 0.1389 0.0862 0.1010 0.1480 0.1446 0.1154 0.1097 0.1368 0.0911 0.0907 0.1235 0.1241 0.0968 0.1312 0.1213 0.1020 0.1317 0.1035 0.1307 0.0988 0.1022 0.1287 0.1139 0.0914 0.1194 0.0985 0.0947 0.1250 0.1227 0.0848 0.1213 0.1469
va: 2.0012 2.1221 2.1672 2.0993 2.1297 2.1356 2.0771 2.1056 2.0251 3.5528 3.4209 3.7320 3.8209 3.9870 3.8638 3.8885 3.9766 3.8759 4.0347 3.7953 3.7720 3.8411 3.7239 3.8605 4.2339 3.8748 4.1168 3.9220 4.0046 4.0936 3.9647 3.9856 3.9614 3.8845 3.8185 3.9946 4.1042 3.9782 3.8284 3.8842 3.8770 3.8808 3.9000 3.8392 1.0188 1.0125 1.0409 1.0030 1.0542 0.9859 0.9889 1.0033 1.0136 1.0431 1.0154 1.0405 0.9957 0.9968 1.0054 0.9980 1.0359 0.9865 0.9910 0.9978 1.0063 1.0305 1.0158 0.9944 0.9955 0.9933 1.0406 1.0349 0.9875 0.9877 0.9983 0.9871 0.9928 0.9970 0.9874 0.9876 0.9984 0.9906 0.9932 1.0027 1.0133
dispcorr: -0.049499275 hartree
energy: -2068.746979460613
dipole: 0.55117 2.87045 3.42161 7.87903 -8.55868 -0.67965 5.34367 -3.83943 1.50424
magnitude: 3.79896 au
magnitude: 9.65619 debye
temp: 298.15 k
press: 1.00 atm
zeropoint: 0.72177291 hartree
thermalvibcorrection: 0.03905475 hartree
thermalrotcorrection: 0.00141627 hartree
thermaltrasncorrection: 0.00141627 hartree
thermaltotal: -2067.98331926 hartree
thermalcorr: 0.04188729 hartree
nonthermalcorr: 0.72177291 hartree
totalcorr: 0.76366020 hartree
thermalcorrenthalpy: 0.00094421 hartree
totalenthalpy: -2067.98237505 hartree
totalentropycorr: -0.11132674 hartree
gibbsenthalpy: -2068.09370179 hartree
gibbsminuselec: 0.65327767 hartree
