program: Orca
programVersion: 5.0.2
elementType: Cl O O O O N N C C C C C C C C C C C C C C C C C C C H H H H H H H H H H H H H H H H
charge: 1
multiplicity: 1
keywords: wB97X-D3 TightOpt Freq def2-TZVPP def2/J RIJCOSX TightSCF defgrid3 CHELPG
frequency: 0.00 0.00 0.00 0.00 0.00 0.00 15.79 26.60 43.83 49.30 53.68 60.85 71.26 93.53 115.16 127.56 144.57 161.39 187.29 237.86 249.87 269.35 289.98 296.46 317.49 325.93 346.70 402.99 417.40 435.84 452.10 464.46 483.49 491.60 509.80 536.49 541.12 555.61 561.85 579.02 588.80 636.41 642.70 663.32 683.29 708.30 720.97 741.41 752.91 760.94 766.47 779.32 785.48 791.93 811.40 854.83 869.97 881.60 891.75 899.38 910.34 932.57 977.56 985.14 992.77 1010.89 1026.19 1038.15 1041.29 1042.63 1075.82 1081.70 1099.64 1144.52 1161.26 1179.66 1182.77 1190.21 1194.02 1226.02 1228.93 1243.03 1251.11 1268.17 1277.09 1300.91 1321.72 1328.96 1348.32 1349.70 1366.47 1369.53 1381.54 1435.77 1445.69 1459.81 1460.45 1499.38 1523.22 1533.76 1560.81 1563.76 1638.37 1645.78 1670.19 1691.67 1708.86 1738.28 1781.37 1882.78 3097.25 3117.07 3150.31 3184.37 3204.15 3204.28 3207.78 3215.14 3223.19 3236.34 3240.33 3241.37 3546.38 3636.90 3826.06 3874.72
frequency: 15.79 26.60 43.83 49.30 53.68 60.85 71.26 93.53 115.16 127.56 144.57 161.39 187.29 237.86 249.87 269.35 289.98 296.46 317.49 325.93 346.70 402.99 417.40 435.84 452.10 464.46 483.49 491.60 509.80 536.49 541.12 555.61 561.85 579.02 588.80 636.41 642.70 663.32 683.29 708.30 720.97 741.41 752.91 760.94 766.47 779.32 785.48 791.93 811.40 854.83 869.97 881.60 891.75 899.38 910.34 932.57 977.56 985.14 992.77 1010.89 1026.19 1038.15 1041.29 1042.63 1075.82 1081.70 1099.64 1144.52 1161.26 1179.66 1182.77 1190.21 1194.02 1226.02 1228.93 1243.03 1251.11 1268.17 1277.09 1300.91 1321.72 1328.96 1348.32 1349.70 1366.47 1369.53 1381.54 1435.77 1445.69 1459.81 1460.45 1499.38 1523.22 1533.76 1560.81 1563.76 1638.37 1645.78 1670.19 1691.67 1708.86 1738.28 1781.37 1882.78 3097.25 3117.07 3150.31 3184.37 3204.15 3204.28 3207.78 3215.14 3223.19 3236.34 3240.33 3241.37 3546.38 3636.90 3826.06 3874.72
formula: C19H16ClN2O4
InChI: InChI=1S/C19H16ClN2O4/c20-13-7-5-11(6-8-13)18(24)22-16(19(25)26)9-12-10-17(23)21-15-4-2-1-3-14(12)15/h1-8,10,16,21-22,24-25H,9H2
42 atoms
Cl -6.466793 -0.880665 0.028932
O  2.15447 4.278158 0.136425
O  -0.116251 -2.916067 -1.298446
O  0.084637 4.10819 -0.612564
O  0.042091 -0.111582 1.387755
N  -0.25856 1.629034 0.036781
N  1.97546 -2.744193 -0.449323
C  1.870466 1.438561 -1.199578
C  1.129567 2.066312 0.009921
C  1.987499 -0.05059 -1.030017
C  3.081693 -0.621617 -0.267303
C  3.053533 -2.002237 -0.016297
C  0.998407 -0.839596 -1.490636
C  4.176298 0.114105 0.210922
C  0.882482 -2.242348 -1.112282
C  1.064441 3.587688 -0.167794
C  4.092242 -2.617336 0.686318
C  -0.763136 0.602426 0.650459
C  5.195521 -0.490878 0.907502
C  5.149496 -1.865961 1.143173
C  -2.173281 0.251626 0.516304
C  -2.517767 -1.089233 0.331813
C  -3.156942 1.241313 0.53565
C  -3.844414 -1.435907 0.172391
C  -4.482795 0.889881 0.395033
C  -4.820778 -0.447754 0.213172
H  2.842346 1.918846 -1.304595
H  1.304971 1.674066 -2.101933
H  1.612085 1.787527 0.947829
H  0.180178 -0.450857 -2.083493
H  -0.874118 2.205241 -0.528969
H  4.243075 1.175789 0.010926
H  1.923764 -3.722373 -0.209199
H  4.059332 -3.685217 0.864087
H  6.035224 0.092149 1.259614
H  5.952911 -2.348227 1.683957
H  -1.75771 -1.8582 0.231995
H  -2.896042 2.280581 0.696881
H  -4.123362 -2.465923 0.001139
H  -5.258331 1.641941 0.429071
H  2.839822 3.741155 0.542286
H  -0.439817 -0.806997 1.849936
totalener: -1604.18902545 hartree
nucrepener: 2409.41374318 hartree
electener: -4013.60276863 hartree
oneelecener: -6957.87504966 hartree
twoeener: 2944.27228103 hartree
kineticenergy: 1597.89827598 hartree
xcener: -129.712667867336 hartree
chargesum: 1.0000000
charge: 0.014056 -0.189516 -0.390380 -0.306839 -0.198511 -0.110788 -0.094229 -0.220513 -0.053460 0.073345 0.036204 0.059817 -0.149314 -0.173901 0.234283 0.384823 -0.127035 0.434422 -0.149679 -0.071101 0.055043 -0.194851 -0.194068 -0.156691 -0.119521 0.095490 0.135820 0.148925 0.147982 0.128358 0.201765 0.109946 0.151568 0.121596 0.142497 0.148901 0.175924 0.154126 0.149736 0.147714 0.206580 0.241476
charge: 0.486255 0.424407 0.068519 0.158692 0.472675 0.423470 0.380798 0.020651 -0.079836 -0.049880 -0.070829 -0.097966 0.002748 0.001571 -0.403085 -0.436080 0.004838 -0.193099 -0.005764 0.019437 -0.108675 0.029260 0.026881 0.003754 -0.000598 -0.371762 0.036459 0.049408 0.041570 0.031112 0.019261 0.016006 0.008812 0.028285 0.028132 0.034208 0.034781 0.036240 0.039857 0.037961 -0.092300 -0.056171
qa: 0.0141 -0.1895 -0.3904 -0.3068 -0.1985 -0.1108 -0.0942 -0.2205 -0.0535 0.0733 0.0362 0.0598 -0.1493 -0.1739 0.2343 0.3848 -0.1270 0.4344 -0.1497 -0.0711 0.0550 -0.1949 -0.1941 -0.1567 -0.1195 0.0955 0.1358 0.1489 0.1480 0.1284 0.2018 0.1099 0.1516 0.1216 0.1425 0.1489 0.1759 0.1541 0.1497 0.1477 0.2066 0.2415
va: 1.3255 2.2887 2.1132 2.1692 2.3188 3.3959 3.2956 3.8232 3.9125 3.4081 3.7005 4.0864 3.7608 3.9528 4.3243 4.2432 3.9707 3.9856 4.0532 4.0135 3.4775 4.0279 4.0639 4.1080 4.0302 4.0543 1.0168 1.0225 1.0093 1.0186 1.0277 1.0202 1.0324 1.0143 1.0011 0.9956 1.0245 1.0105 1.0094 1.0094 1.0302 1.0133
dispcorr: -0.024483350 hartree
energy: -1604.217542180815
dipole: 24.27126 -22.98035 1.29091 2.43920 -2.01044 0.42876 2.20328 -0.48865 1.71462
magnitude: 2.18865 au
magnitude: 5.56311 debye
temp: 298.15 k
press: 1.00 atm
zeropoint: 0.32833314 hartree
thermalvibcorrection: 0.01905127 hartree
thermalrotcorrection: 0.00141627 hartree
thermaltrasncorrection: 0.00141627 hartree
thermaltotal: -1603.86732523 hartree
thermalcorr: 0.02188381 hartree
nonthermalcorr: 0.32833314 hartree
totalcorr: 0.35021695 hartree
thermalcorrenthalpy: 0.00094421 hartree
totalenthalpy: -1603.86638102 hartree
totalentropycorr: -0.07158675 hartree
gibbsenthalpy: -1603.93796778 hartree
gibbsminuselec: 0.27957440 hartree
