program: Orca
programVersion: 5.0.2
elementType: C C C C C C C C H C H C H H N H H N H H C H H C H H H N N Cl H
charge: 1
multiplicity: 1
keywords: wB97X-D3 TightOpt Freq def2-TZVPP def2/J RIJCOSX TightSCF defgrid3 CHELPG
frequency: 0.00 0.00 0.00 0.00 0.00 0.00 26.19 42.45 48.17 62.31 105.28 158.11 163.89 194.73 202.37 214.45 226.59 282.52 290.64 303.08 336.96 355.07 367.89 423.96 469.61 476.25 481.48 519.04 523.21 546.78 601.06 608.65 637.53 653.39 671.27 715.24 752.33 765.05 780.48 813.53 834.99 874.95 876.03 952.12 1003.25 1006.22 1024.27 1025.39 1042.69 1065.10 1077.96 1104.49 1126.47 1140.93 1142.54 1160.60 1213.46 1282.76 1297.18 1312.48 1335.97 1338.97 1359.82 1374.37 1411.52 1448.72 1450.04 1493.52 1503.22 1514.00 1539.01 1549.22 1604.54 1641.42 1646.32 1656.23 1683.90 1702.17 1728.75 3071.44 3099.57 3142.67 3160.73 3166.16 3202.15 3202.62 3234.03 3234.82 3626.94 3638.04 3647.44 3752.44 3773.25
frequency: 26.19 42.45 48.17 62.31 105.28 158.11 163.89 194.73 202.37 214.45 226.59 282.52 290.64 303.08 336.96 355.07 367.89 423.96 469.61 476.25 481.48 519.04 523.21 546.78 601.06 608.65 637.53 653.39 671.27 715.24 752.33 765.05 780.48 813.53 834.99 874.95 876.03 952.12 1003.25 1006.22 1024.27 1025.39 1042.69 1065.10 1077.96 1104.49 1126.47 1140.93 1142.54 1160.60 1213.46 1282.76 1297.18 1312.48 1335.97 1338.97 1359.82 1374.37 1411.52 1448.72 1450.04 1493.52 1503.22 1514.00 1539.01 1549.22 1604.54 1641.42 1646.32 1656.23 1683.90 1702.17 1728.75 3071.44 3099.57 3142.67 3160.73 3166.16 3202.15 3202.62 3234.03 3234.82 3626.94 3638.04 3647.44 3752.44 3773.25
formula: C12H14ClN4
InChI: InChI=1S/C12H14ClN4/c1-2-9-10(11(14)17-12(15)16-9)7-3-5-8(13)6-4-7/h3-6,17H,2,14-15H2,1H3
31 atoms
C  3.646063 -0.285267 0.071581
C  1.714587 0.896496 0.349636
C  0.914981 -0.209619 0.071872
C  1.569745 -1.40763 -0.212384
C  -0.573131 -0.179212 0.058966
C  -1.262751 0.112527 -1.115243
C  -1.296919 -0.457289 1.216329
C  -2.647097 0.137061 -1.135424
H  -0.713818 0.329411 -2.023735
C  -2.681129 -0.435184 1.207062
H  -0.774395 -0.682514 2.138293
C  -3.349958 -0.136767 0.028642
H  -3.181525 0.37002 -2.045974
H  -3.242188 -0.643874 2.107437
N  0.933263 -2.544861 -0.491126
H  1.406391 -3.405372 -0.695311
H  -0.072625 -2.542532 -0.499408
N  4.979208 -0.363476 0.057871
H  5.488545 -1.204611 -0.135134
H  5.490852 0.474818 0.269485
C  1.128448 2.241034 0.637674
H  0.107113 2.136493 0.999555
H  1.728958 2.700667 1.422564
C  1.156212 3.123406 -0.615275
H  2.173414 3.237349 -0.988421
H  0.540136 2.700682 -1.409633
H  0.766887 4.112037 -0.379816
N  3.057928 0.84664 0.34379
N  2.931696 -1.418588 -0.20482
Cl -5.070807 -0.1069 0.010972
H  3.419254 -2.277212 -0.406864
totalener: -1144.80635913 hartree
nucrepener: 1268.10935914 hartree
electener: -2412.91571827 hartree
oneelecener: -4063.47055208 hartree
twoeener: 1650.55483381 hartree
kineticenergy: 1140.54111846 hartree
xcener: -88.330070703089 hartree
chargesum: 1.0000000
charge: 0.414078 0.203621 0.070830 0.277613 -0.188813 -0.125509 -0.120399 -0.156402 0.141385 -0.146235 0.136715 0.110681 0.140654 0.141150 -0.202715 0.158766 0.209116 -0.223754 0.161219 0.208479 -0.118187 0.101818 0.104086 -0.253583 0.102172 0.083432 0.110946 -0.341585 -0.119144 -0.019915 0.139480
charge: -0.286457 -0.086547 -0.078748 -0.143717 -0.100264 0.003037 0.004474 -0.015857 0.030965 -0.016149 0.032705 -0.387746 0.032536 0.032646 0.414594 -0.013714 0.002785 0.398343 -0.018666 0.006229 -0.002472 0.033813 0.039848 0.030696 0.017913 0.012977 0.023283 0.173421 0.400011 0.449413 0.010648
qa: 0.4141 0.2036 0.0708 0.2776 -0.1888 -0.1255 -0.1204 -0.1564 0.1414 -0.1462 0.1367 0.1107 0.1407 0.1412 -0.2027 0.1588 0.2091 -0.2238 0.1612 0.2085 -0.1182 0.1018 0.1041 -0.2536 0.1022 0.0834 0.1109 -0.3416 -0.1191 -0.0199 0.1395
va: 4.1646 3.8707 3.4538 4.0520 3.5330 3.9301 3.9272 4.0463 1.0063 4.0225 1.0110 3.9846 1.0110 1.0105 3.3608 1.0298 1.0047 3.2971 1.0281 1.0068 3.9248 1.0018 1.0125 3.9217 1.0067 1.0049 1.0060 3.0439 3.4272 1.2863 1.0359
dispcorr: -0.014142751 hartree
energy: -1144.822776802299
dipole: 20.14312 -15.73533 4.40779 5.40249 -7.64909 -2.24659 -1.62650 1.19790 -0.42860
magnitude: 4.96584 au
magnitude: 12.62215 debye
temp: 298.15 k
press: 1.00 atm
zeropoint: 0.25359986 hartree
thermalvibcorrection: 0.01340495 hartree
thermalrotcorrection: 0.00141627 hartree
thermaltrasncorrection: 0.00141627 hartree
thermaltotal: -1144.55293945 hartree
thermalcorr: 0.01623749 hartree
nonthermalcorr: 0.25359986 hartree
totalcorr: 0.26983735 hartree
thermalcorrenthalpy: 0.00094421 hartree
totalenthalpy: -1144.55199524 hartree
totalentropycorr: -0.05934726 hartree
gibbsenthalpy: -1144.61134251 hartree
gibbsminuselec: 0.21143429 hartree
