program: Orca
programVersion: 5.0.2
elementType: C C C C C H H H N C H H C H H C H H H C N H H S H
charge: 1
multiplicity: 1
keywords: wB97X-D3 TightOpt Freq def2-TZVPP def2/J RIJCOSX TightSCF defgrid3 CHELPG
frequency: 0.00 0.00 0.00 0.00 0.00 0.00 23.81 29.79 77.88 94.63 121.11 173.48 242.64 263.14 277.45 323.19 341.52 372.86 432.45 480.62 523.81 573.11 610.77 642.41 698.04 746.94 753.11 765.25 808.42 879.87 887.32 903.65 921.00 959.39 982.15 1025.54 1035.47 1063.00 1101.75 1118.23 1152.18 1160.46 1249.53 1256.66 1273.27 1317.90 1324.68 1338.35 1373.50 1389.57 1398.00 1434.97 1436.24 1496.20 1502.10 1505.41 1518.02 1524.41 1564.27 1657.80 1681.92 1706.16 3054.95 3067.10 3072.97 3094.42 3133.40 3142.81 3157.25 3229.73 3247.68 3259.46 3610.35 3611.71 3738.66
frequency: 23.81 29.79 77.88 94.63 121.11 173.48 242.64 263.14 277.45 323.19 341.52 372.86 432.45 480.62 523.81 573.11 610.77 642.41 698.04 746.94 753.11 765.25 808.42 879.87 887.32 903.65 921.00 959.39 982.15 1025.54 1035.47 1063.00 1101.75 1118.23 1152.18 1160.46 1249.53 1256.66 1273.27 1317.90 1324.68 1338.35 1373.50 1389.57 1398.00 1434.97 1436.24 1496.20 1502.10 1505.41 1518.02 1524.41 1564.27 1657.80 1681.92 1706.16 3054.95 3067.10 3072.97 3094.42 3133.40 3142.81 3157.25 3229.73 3247.68 3259.46 3610.35 3611.71 3738.66
formula: C9H13N2S
InChI: InChI=1S/C9H13N2S/c1-2-3-8-6-7(9(10)12)4-5-11-8/h4-6,11H,2-3,10H2,1H3
25 atoms
C  -1.230186 0.382494 -0.366989
C  -0.113885 -0.424041 -0.234958
C  1.099179 0.110627 0.181357
C  1.177431 1.473602 0.489861
C  0.056665 2.240611 0.369904
H  -0.195231 -1.469913 -0.498825
H  2.114257 1.914947 0.796819
H  0.030179 3.298595 0.586805
N  -1.096261 1.682589 -0.052888
C  -2.575576 -0.110488 -0.785667
H  -2.440628 -0.939381 -1.481248
H  -3.10337 0.675742 -1.3318
C  -3.417305 -0.570549 0.416191
H  -2.874029 -1.352368 0.952631
H  -3.535507 0.260071 1.117775
C  -4.782246 -1.084552 -0.017656
H  -4.687443 -1.935843 -0.692878
H  -5.362784 -1.407551 0.844938
H  -5.353121 -0.310321 -0.532053
C  2.328372 -0.738225 0.226549
N  2.218595 -1.878205 0.917337
H  3.014422 -2.49289 0.962858
H  1.436296 -2.071675 1.516995
S  3.629623 -0.250822 -0.6240
H  -1.908236 2.277046 -0.150372
totalener: -858.31208447 hartree
nucrepener: 749.68222723 hartree
electener: -1607.99431170 hartree
oneelecener: -2644.07860833 hartree
twoeener: 1036.08429663 hartree
kineticenergy: 855.13278439 hartree
xcener: -65.122451641145 hartree
chargesum: 1.0000000
charge: 0.166367 -0.099402 0.050753 -0.078865 0.075003 0.158737 0.159921 0.175158 -0.068188 -0.125589 0.102704 0.091694 -0.089382 0.084942 0.071644 -0.238920 0.087556 0.105563 0.084138 0.094594 -0.187508 0.192265 0.169075 -0.169910 0.187651
charge: -0.052820 0.043436 -0.040425 0.040604 0.031654 0.048069 0.049954 0.043514 0.445141 -0.001658 0.047012 0.038176 -0.027762 0.023901 0.020316 0.017978 0.018517 0.022853 0.017393 -0.529429 0.383353 -0.001594 -0.017866 0.340255 0.039428
qa: 0.1664 -0.0994 0.0508 -0.0789 0.0750 0.1587 0.1599 0.1752 -0.0682 -0.1256 0.1027 0.0917 -0.0894 0.0849 0.0716 -0.2389 0.0876 0.1056 0.0841 0.0946 -0.1875 0.1923 0.1691 -0.1699 0.1877
va: 3.8712 3.9255 3.8424 4.0070 3.9316 1.0065 1.0150 0.9899 3.5823 3.8405 1.0126 1.0138 3.8521 1.0078 1.0106 3.9634 1.0038 1.0057 1.0041 4.1947 3.2854 1.0131 1.0147 2.2489 0.9961
dispcorr: -0.008950096 hartree
energy: -858.322783748318
dipole: -22.85819 20.71828 -2.13991 -3.39515 4.11055 0.71540 2.14925 -1.24714 0.90211
magnitude: 2.42998 au
magnitude: 6.17653 debye
temp: 298.15 k
press: 1.00 atm
zeropoint: 0.21400176 hartree
thermalvibcorrection: 0.00938682 hartree
thermalrotcorrection: 0.00141627 hartree
thermaltrasncorrection: 0.00141627 hartree
thermaltotal: -858.09656263 hartree
thermalcorr: 0.01221936 hartree
nonthermalcorr: 0.21400176 hartree
totalcorr: 0.22622112 hartree
thermalcorrenthalpy: 0.00094421 hartree
totalenthalpy: -858.09561842 hartree
totalentropycorr: -0.05143288 hartree
gibbsenthalpy: -858.14705130 hartree
gibbsminuselec: 0.17573245 hartree
