program: Orca
programVersion: 5.0.2
elementType: C C C C C C C C H H H H N H C H C H C H H C H H C H C H H C H H S C H H H N C H H C H H C H H H H
charge: 1
multiplicity: 1
keywords: wB97X-D3 TightOpt Freq def2-TZVPP def2/J RIJCOSX TightSCF defgrid3 CHELPG
frequency: 0.00 0.00 0.00 0.00 0.00 0.00 27.79 37.38 40.83 55.42 69.46 86.23 97.83 104.06 145.03 165.90 188.69 200.99 202.44 214.28 226.81 239.58 255.06 280.81 317.50 328.38 339.53 372.90 432.49 448.47 467.74 477.14 481.60 509.77 528.87 549.27 570.47 611.13 614.01 635.64 653.19 750.12 761.48 762.86 771.70 784.07 808.44 825.09 827.52 855.96 859.65 876.54 893.84 902.89 926.19 931.35 950.72 969.85 984.66 991.26 1005.10 1013.01 1019.64 1028.48 1053.78 1076.15 1081.54 1084.79 1088.64 1120.51 1125.35 1136.22 1141.08 1142.95 1172.28 1176.28 1191.54 1196.65 1208.86 1236.44 1262.59 1266.23 1277.99 1294.47 1302.98 1316.15 1326.20 1336.61 1344.03 1351.74 1356.12 1368.01 1375.70 1378.16 1383.40 1394.12 1402.48 1417.97 1422.51 1425.88 1429.03 1435.62 1442.14 1443.65 1475.54 1478.43 1485.42 1492.06 1495.36 1497.04 1498.21 1503.86 1504.98 1509.17 1510.34 1521.08 1575.74 1632.72 1692.86 1706.11 2991.78 3018.75 3025.22 3046.02 3052.77 3057.50 3068.68 3069.84 3087.38 3093.34 3096.11 3103.09 3117.01 3130.30 3144.25 3145.74 3157.51 3162.55 3175.09 3178.97 3186.99 3207.77 3218.51 3229.69 3271.72 3465.89 3721.34
frequency: 27.79 37.38 40.83 55.42 69.46 86.23 97.83 104.06 145.03 165.90 188.69 200.99 202.44 214.28 226.81 239.58 255.06 280.81 317.50 328.38 339.53 372.90 432.49 448.47 467.74 477.14 481.60 509.77 528.87 549.27 570.47 611.13 614.01 635.64 653.19 750.12 761.48 762.86 771.70 784.07 808.44 825.09 827.52 855.96 859.65 876.54 893.84 902.89 926.19 931.35 950.72 969.85 984.66 991.26 1005.10 1013.01 1019.64 1028.48 1053.78 1076.15 1081.54 1084.79 1088.64 1120.51 1125.35 1136.22 1141.08 1142.95 1172.28 1176.28 1191.54 1196.65 1208.86 1236.44 1262.59 1266.23 1277.99 1294.47 1302.98 1316.15 1326.20 1336.61 1344.03 1351.74 1356.12 1368.01 1375.70 1378.16 1383.40 1394.12 1402.48 1417.97 1422.51 1425.88 1429.03 1435.62 1442.14 1443.65 1475.54 1478.43 1485.42 1492.06 1495.36 1497.04 1498.21 1503.86 1504.98 1509.17 1510.34 1521.08 1575.74 1632.72 1692.86 1706.11 2991.78 3018.75 3025.22 3046.02 3052.77 3057.50 3068.68 3069.84 3087.38 3093.34 3096.11 3103.09 3117.01 3130.30 3144.25 3145.74 3157.51 3162.55 3175.09 3178.97 3186.99 3207.77 3218.51 3229.69 3271.72 3465.89 3721.34
formula: C19H27N2S
InChI: InChI=1S/C19H27N2S/c1-3-7-21-11-13(12-22-2)8-16-15-5-4-6-17-19(15)14(10-20-17)9-18(16)21/h4-6,10,13,16,18,20-21H,3,7-9,11-12H2,1-2H3
49 atoms
C  2.767861 -0.502412 -0.08589
C  4.015896 -1.086328 0.130263
C  4.128762 -2.473322 0.233292
C  2.962727 -3.20369 0.119372
C  1.703483 -2.606756 -0.089822
C  1.595223 -1.236806 -0.198036
C  2.923434 0.904802 -0.137889
C  4.250938 1.150049 0.04821
H  5.078069 -2.965543 0.397546
H  3.013735 -4.281832 0.195668
H  0.836706 -3.250068 -0.165522
H  4.795322 2.080108 0.083378
N  4.912954 -0.048293 0.204036
H  5.900051 -0.137316 0.353978
C  0.335193 -0.433008 -0.455821
H  0.237991 -0.311823 -1.545339
C  0.478576 0.990838 0.140074
H  0.504104 0.921057 1.230861
C  1.718995 1.762469 -0.349811
H  1.594412 2.007638 -1.412519
H  1.828448 2.700358 0.191746
C  -0.916152 -1.132891 0.059474
H  -1.010655 -2.10653 -0.417641
H  -0.812557 -1.322196 1.133167
C  -2.173387 -0.317179 -0.198472
H  -2.321355 -0.224464 -1.282206
C  -2.009628 1.078802 0.373139
H  -2.870412 1.696711 0.134075
H  -1.887521 1.058205 1.458049
C  -3.432615 -0.951266 0.390273
H  -4.287029 -0.283216 0.256769
H  -3.299288 -1.117365 1.463005
S  -3.780222 -2.5209 -0.430005
C  -5.270756 -2.997171 0.451242
H  -6.066349 -2.268075 0.305772
H  -5.589814 -3.949191 0.032213
H  -5.074889 -3.132209 1.513735
N  -0.795287 1.76943 -0.173959
C  -0.744598 3.208584 0.258823
H  0.132694 3.644748 -0.208612
H  -0.587736 3.204085 1.338399
C  -1.9678 4.023219 -0.132984
H  -2.213098 3.838252 -1.183872
H  -2.838172 3.734221 0.455867
C  -1.695671 5.509528 0.074221
H  -0.870619 5.855088 -0.549709
H  -2.575326 6.096571 -0.18219
H  -1.446668 5.724901 1.114162
H  -0.886135 1.769728 -1.190961
totalener: -1247.86182648 hartree
nucrepener: 1957.82711674 hartree
electener: -3205.68894322 hartree
oneelecener: -5569.45435060 hartree
twoeener: 2363.76540738 hartree
kineticenergy: 1242.33221219 hartree
xcener: -105.698450520811 hartree
chargesum: 1.0000000
charge: -0.020507 -0.025347 -0.104358 -0.097923 -0.170426 -0.093997 -0.227015 0.023841 0.125812 0.133053 0.118006 0.154225 -0.139484 0.145454 0.171474 0.097771 -0.074808 0.134159 -0.119241 0.110742 0.098397 -0.254958 0.115785 0.108047 0.084011 0.087410 -0.257430 0.145471 0.143345 -0.218354 0.104752 0.101311 -0.082563 -0.268054 0.111974 0.128040 0.113423 0.248961 -0.133689 0.127881 0.137170 -0.119106 0.085204 0.086123 -0.250420 0.087914 0.108960 0.093934 0.125027
charge: -0.074074 -0.111719 0.000180 -0.003102 -0.007401 -0.054126 -0.105362 -0.037695 0.023610 0.025707 0.020311 0.012611 0.384569 -0.012444 -0.046004 0.042971 -0.018725 0.045410 -0.003931 0.033107 0.028490 -0.006867 0.031026 0.039857 -0.123338 0.035904 0.016982 0.030946 0.040838 -0.230343 0.005642 0.007299 0.556607 -0.205679 -0.005668 0.006777 -0.005392 0.462222 0.003843 0.029726 0.037960 -0.040573 0.024619 0.021461 0.023273 0.017593 0.024287 0.019948 0.038666
qa: -0.0205 -0.0253 -0.1044 -0.0979 -0.1704 -0.0940 -0.2270 0.0238 0.1258 0.1331 0.1180 0.1542 -0.1395 0.1455 0.1715 0.0978 -0.0748 0.1342 -0.1192 0.1107 0.0984 -0.2550 0.1158 0.1080 0.0840 0.0874 -0.2574 0.1455 0.1433 -0.2184 0.1048 0.1013 -0.0826 -0.2681 0.1120 0.1280 0.1134 0.2490 -0.1337 0.1279 0.1372 -0.1191 0.0852 0.0861 -0.2504 0.0879 0.1090 0.0939 0.1250
va: 3.9138 3.9713 4.0248 3.9894 4.0086 3.9853 3.9424 3.9299 1.0069 1.0011 1.0109 0.9991 3.4416 1.0275 3.6949 1.0005 3.8409 0.9994 4.0189 0.9837 1.0148 3.9080 1.0289 1.0163 3.7405 1.0302 3.9307 1.0036 1.0003 4.1413 1.0033 0.9989 2.2323 4.0038 0.9982 1.0021 0.9989 3.5483 3.8062 0.9979 0.9970 3.8944 1.0021 1.0096 3.9704 1.0046 1.0054 1.0015 1.0395
dispcorr: -0.024050626 hartree
energy: -1247.888960050314
dipole: -20.88713 20.13075 -0.75638 19.27960 -16.26688 3.01272 3.49565 -3.05195 0.44370
magnitude: 3.13775 au
magnitude: 7.97553 debye
temp: 298.15 k
press: 1.00 atm
zeropoint: 0.43801578 hartree
thermalvibcorrection: 0.01801194 hartree
thermalrotcorrection: 0.00141627 hartree
thermaltrasncorrection: 0.00141627 hartree
thermaltotal: -1247.43009979 hartree
thermalcorr: 0.02084448 hartree
nonthermalcorr: 0.43801578 hartree
totalcorr: 0.45886026 hartree
thermalcorrenthalpy: 0.00094421 hartree
totalenthalpy: -1247.42915558 hartree
totalentropycorr: -0.06889531 hartree
gibbsenthalpy: -1247.49805089 hartree
gibbsminuselec: 0.39090916 hartree
