program: Orca
programVersion: 5.0.2
elementType: C C C C C C C C H H H H N H C H C H C H H C H H C H C H H C H H S C H H H N C H H C H H C H H H H
charge: 1
multiplicity: 1
keywords: wB97X-D3 TightOpt Freq def2-TZVPP def2/J RIJCOSX TightSCF defgrid3 CHELPG
frequency: 0.00 0.00 0.00 0.00 0.00 0.00 27.95 39.09 41.58 55.83 65.45 84.37 101.92 106.54 149.19 170.97 179.56 200.36 205.42 207.45 227.71 238.38 260.70 285.89 317.94 327.61 342.34 372.82 405.73 443.98 450.64 469.73 483.15 515.65 527.87 553.29 572.93 613.19 617.54 636.90 654.70 690.86 737.16 763.82 764.47 770.44 772.32 778.24 816.80 823.78 832.28 851.35 865.22 899.70 903.94 912.32 915.76 925.58 967.07 974.01 997.14 1001.93 1016.64 1034.24 1067.16 1078.46 1084.98 1091.45 1104.03 1111.89 1120.45 1126.54 1140.29 1144.59 1155.42 1161.34 1181.23 1193.30 1203.06 1230.60 1244.84 1247.39 1266.36 1269.06 1284.41 1293.63 1300.11 1319.46 1324.10 1332.02 1339.51 1349.46 1357.95 1362.60 1380.29 1381.65 1387.85 1393.29 1398.73 1417.85 1424.63 1428.50 1441.64 1443.89 1463.05 1467.66 1471.61 1475.11 1490.11 1495.72 1499.00 1504.66 1507.01 1507.68 1508.59 1521.21 1573.08 1634.77 1691.78 1701.73 2704.09 2904.90 2923.27 2948.75 3026.86 3032.23 3048.42 3049.04 3053.90 3060.11 3079.00 3082.91 3089.17 3092.75 3127.53 3130.42 3133.40 3144.75 3152.15 3157.74 3191.29 3193.14 3207.23 3208.43 3223.51 3269.63 3728.05
frequency: 27.95 39.09 41.58 55.83 65.45 84.37 101.92 106.54 149.19 170.97 179.56 200.36 205.42 207.45 227.71 238.38 260.70 285.89 317.94 327.61 342.34 372.82 405.73 443.98 450.64 469.73 483.15 515.65 527.87 553.29 572.93 613.19 617.54 636.90 654.70 690.86 737.16 763.82 764.47 770.44 772.32 778.24 816.80 823.78 832.28 851.35 865.22 899.70 903.94 912.32 915.76 925.58 967.07 974.01 997.14 1001.93 1016.64 1034.24 1067.16 1078.46 1084.98 1091.45 1104.03 1111.89 1120.45 1126.54 1140.29 1144.59 1155.42 1161.34 1181.23 1193.30 1203.06 1230.60 1244.84 1247.39 1266.36 1269.06 1284.41 1293.63 1300.11 1319.46 1324.10 1332.02 1339.51 1349.46 1357.95 1362.60 1380.29 1381.65 1387.85 1393.29 1398.73 1417.85 1424.63 1428.50 1441.64 1443.89 1463.05 1467.66 1471.61 1475.11 1490.11 1495.72 1499.00 1504.66 1507.01 1507.68 1508.59 1521.21 1573.08 1634.77 1691.78 1701.73 2704.09 2904.90 2923.27 2948.75 3026.86 3032.23 3048.42 3049.04 3053.90 3060.11 3079.00 3082.91 3089.17 3092.75 3127.53 3130.42 3133.40 3144.75 3152.15 3157.74 3191.29 3193.14 3207.23 3208.43 3223.51 3269.63 3728.05
formula: C19H27N2S
InChI: InChI=1S/C19H27N2S/c1-3-7-21-11-13(12-22-2)8-16-15-5-4-6-17-19(15)14(10-20-17)9-18(16)21/h4-6,10,13,16,18,20,22H,3,7-9,11-12H2,1-2H3
49 atoms
C  2.771765 -0.516362 -0.091727
C  4.013847 -1.122505 0.104967
C  4.108831 -2.513181 0.177595
C  2.932354 -3.225557 0.054064
C  1.681795 -2.604445 -0.137297
C  1.587863 -1.229502 -0.216437
C  2.938532 0.891158 -0.114761
C  4.268969 1.112582 0.069338
H  5.052325 -3.021703 0.326484
H  2.970021 -4.306076 0.107457
H  0.807194 -3.237797 -0.223705
H  4.824883 2.034915 0.124351
N  4.923223 -0.099775 0.19613
H  5.90892 -0.203186 0.341578
C  0.349821 -0.389061 -0.4529
H  0.249849 -0.22384 -1.532847
C  0.474615 1.024159 0.182171
H  0.571648 0.885861 1.275679
C  1.740294 1.764629 -0.297562
H  1.60582 2.036098 -1.349883
H  1.867428 2.689813 0.261141
C  -0.909066 -1.098257 0.032098
H  -1.005124 -2.051941 -0.495876
H  -0.799489 -1.337478 1.096654
C  -2.139248 -0.227427 -0.168789
H  -2.30529 -0.064251 -1.239278
C  -1.908313 1.143077 0.461883
H  -2.782452 1.768933 0.288021
H  -1.806885 1.02238 1.558649
C  -3.401746 -0.826765 0.442153
H  -4.288411 -0.220188 0.258644
H  -3.290663 -0.989063 1.516602
S  -3.721416 -2.481222 -0.224169
C  -5.440026 -2.795782 0.182263
H  -6.069809 -1.96311 -0.117799
H  -5.732382 -3.71402 -0.322541
H  -5.482256 -2.947463 1.259018
N  -0.749341 1.782873 -0.116184
C  -0.68843 3.197444 0.25257
H  0.188706 3.626403 -0.224279
H  -0.550909 3.320674 1.341058
C  -1.886539 4.019718 -0.208928
H  -2.104508 3.763423 -1.249281
H  -2.779459 3.782153 0.374092
C  -1.610892 5.513236 -0.083589
H  -0.770195 5.813442 -0.710953
H  -2.477159 6.100282 -0.386705
H  -1.371191 5.786041 0.945799
H  -3.859261 -2.155283 -1.52084
totalener: -1247.80731068 hartree
nucrepener: 1960.26475604 hartree
electener: -3208.07206672 hartree
oneelecener: -5576.03637393 hartree
twoeener: 2367.96430720 hartree
kineticenergy: 1242.27875536 hartree
xcener: -105.691081034472 hartree
chargesum: 1.0000000
charge: -0.022032 -0.025427 -0.116897 -0.104258 -0.196886 -0.068544 -0.205291 0.016205 0.118822 0.121203 0.086554 0.149572 -0.144989 0.137741 0.216650 0.075230 0.017602 0.086071 -0.133399 0.101965 0.088053 -0.307160 0.090577 0.114474 0.132933 0.078669 -0.256137 0.100032 0.097631 -0.207130 0.151810 0.157027 0.303330 -0.222864 0.141808 0.157707 0.151948 -0.133498 -0.108953 0.085085 0.081940 -0.100523 0.074227 0.054923 -0.260264 0.082577 0.093038 0.082206 0.166642
charge: -0.069686 -0.116074 -0.009470 -0.017386 -0.031060 -0.050535 -0.095396 -0.042966 0.019890 0.019903 0.007469 0.009440 0.377473 -0.018354 -0.039285 0.042312 -0.094971 0.025387 -0.000904 0.033741 0.026150 -0.022639 0.014786 0.037125 -0.113290 0.035586 -0.072402 0.023130 0.018113 -0.144058 0.022281 0.031109 1.103165 -0.103367 0.014771 0.023542 0.024538 0.198813 -0.077345 0.022345 0.013082 -0.047946 0.019107 0.007402 0.007133 0.013653 0.013934 0.014000 -0.052246
qa: -0.0220 -0.0254 -0.1169 -0.1043 -0.1969 -0.0685 -0.2053 0.0162 0.1188 0.1212 0.0866 0.1496 -0.1450 0.1377 0.2166 0.0752 0.0176 0.0861 -0.1334 0.1020 0.0881 -0.3072 0.0906 0.1145 0.1329 0.0787 -0.2561 0.1000 0.0976 -0.2071 0.1518 0.1570 0.3033 -0.2229 0.1418 0.1577 0.1519 -0.1335 -0.1090 0.0851 0.0819 -0.1005 0.0742 0.0549 -0.2603 0.0826 0.0930 0.0822 0.1666
va: 3.9299 3.9619 4.0313 3.9982 3.9933 3.9042 3.9253 3.9228 1.0084 1.0025 1.0121 1.0007 3.4250 1.0316 3.6823 1.0217 3.8951 1.0105 3.9765 0.9973 1.0072 3.9344 1.0116 1.0163 3.6721 1.0395 4.0856 1.0047 1.0119 3.8520 1.0074 1.0060 3.0229 3.9022 1.0028 1.0010 0.9968 2.9491 3.9402 0.9945 1.0002 3.8443 1.0139 1.0058 3.9694 1.0043 1.0061 1.0024 0.9890
dispcorr: -0.023663713 hartree
energy: -1247.834304539866
dipole: -23.63461 17.83755 -5.79706 16.41569 -18.70982 -2.29413 1.77186 -1.66258 0.10928
magnitude: 6.23545 au
magnitude: 15.84925 debye
temp: 298.15 k
press: 1.00 atm
zeropoint: 0.43291770 hartree
thermalvibcorrection: 0.01816843 hartree
thermalrotcorrection: 0.00141627 hartree
thermaltrasncorrection: 0.00141627 hartree
thermaltotal: -1247.38038587 hartree
thermalcorr: 0.02100097 hartree
nonthermalcorr: 0.43291770 hartree
totalcorr: 0.45391867 hartree
thermalcorrenthalpy: 0.00094421 hartree
totalenthalpy: -1247.37944167 hartree
totalentropycorr: -0.06907365 hartree
gibbsenthalpy: -1247.44851531 hartree
gibbsminuselec: 0.38578923 hartree
