program: Orca
programVersion: 5.0.2
elementType: C C C C C C C H H H O C H F F N N H S O C H H C C C C C H H O O C H H H C H H H N H
charge: 1
multiplicity: 1
keywords: wB97X-D3 TightOpt Freq def2-TZVPP def2/J RIJCOSX TightSCF defgrid3 CHELPG
frequency: 0.00 0.00 0.00 0.00 0.00 0.00 18.20 19.62 42.82 45.95 54.66 69.16 82.49 94.08 108.02 117.35 130.05 141.84 144.93 172.08 198.80 209.40 217.23 256.31 258.34 271.32 275.63 312.34 323.24 347.77 363.30 376.34 405.01 428.19 449.36 508.73 515.87 519.55 528.11 551.50 555.47 580.98 591.67 628.49 647.16 651.34 705.24 714.49 733.70 742.19 772.23 776.87 803.99 835.23 845.52 854.66 857.09 863.13 870.63 886.04 889.28 967.67 981.59 1003.31 1005.30 1021.56 1041.51 1103.98 1110.40 1116.63 1126.48 1149.45 1159.39 1167.07 1177.14 1180.26 1181.85 1208.18 1214.09 1215.42 1231.47 1258.60 1270.45 1280.11 1301.14 1305.08 1321.72 1351.15 1365.33 1379.70 1392.58 1412.18 1434.47 1447.18 1476.73 1485.82 1489.55 1501.17 1504.37 1508.60 1513.55 1515.02 1540.88 1556.59 1572.56 1602.76 1658.62 1669.29 1698.03 1717.65 3059.16 3068.78 3110.46 3138.70 3161.16 3179.00 3187.37 3187.72 3194.53 3202.60 3232.19 3244.53 3250.51 3267.29 3278.03 3611.31
frequency: 18.20 19.62 42.82 45.95 54.66 69.16 82.49 94.08 108.02 117.35 130.05 141.84 144.93 172.08 198.80 209.40 217.23 256.31 258.34 271.32 275.63 312.34 323.24 347.77 363.30 376.34 405.01 428.19 449.36 508.73 515.87 519.55 528.11 551.50 555.47 580.98 591.67 628.49 647.16 651.34 705.24 714.49 733.70 742.19 772.23 776.87 803.99 835.23 845.52 854.66 857.09 863.13 870.63 886.04 889.28 967.67 981.59 1003.31 1005.30 1021.56 1041.51 1103.98 1110.40 1116.63 1126.48 1149.45 1159.39 1167.07 1177.14 1180.26 1181.85 1208.18 1214.09 1215.42 1231.47 1258.60 1270.45 1280.11 1301.14 1305.08 1321.72 1351.15 1365.33 1379.70 1392.58 1412.18 1434.47 1447.18 1476.73 1485.82 1489.55 1501.17 1504.37 1508.60 1513.55 1515.02 1540.88 1556.59 1572.56 1602.76 1658.62 1669.29 1698.03 1717.65 3059.16 3068.78 3110.46 3138.70 3161.16 3179.00 3187.37 3187.72 3194.53 3202.60 3232.19 3244.53 3250.51 3267.29 3278.03 3611.31
formula: C16H16F2N3O4S
InChI: InChI=1S/C16H16F2N3O4S/c1-23-13-5-6-19-12(14(13)24-2)8-26(22)16-20-10-4-3-9(25-15(17)18)7-11(10)21-16/h3-7,15,20-21H,8H2,1-2H3
42 atoms
C  -2.245835 -2.039939 -0.235696
C  -1.854275 -0.708521 -0.1576
C  -2.761102 0.343033 -0.119555
C  -4.092748 -0.018716 -0.166232
C  -4.497805 -1.365613 -0.243934
C  -3.590013 -2.394521 -0.279549
C  -0.037613 -1.960327 -0.167207
H  -2.433873 1.368875 -0.064825
H  -5.559106 -1.568841 -0.277401
H  -3.912322 -3.424393 -0.340547
O  -5.138918 0.859695 -0.142358
C  -4.946562 2.214098 -0.11989
H  -5.925875 2.686874 -0.121098
F  -4.235007 2.623239 -1.189107
F  -4.256686 2.590852 0.977522
N  -0.464954 -0.705628 -0.121583
N  -1.072419 -2.782885 -0.243923
H  -0.954418 -3.787772 -0.246316
S  1.616652 -2.688958 -0.262682
O  1.35952 -4.054895 0.211329
C  2.394056 -1.687837 1.057697
H  1.663416 -1.401234 1.809142
H  3.104169 -2.398186 1.481231
C  3.15589 -0.550327 0.431844
C  2.658903 0.740044 0.388055
C  3.420729 1.745908 -0.23288
C  5.043414 0.056419 -0.682308
C  4.647051 1.384178 -0.769184
H  5.993533 -0.249599 -1.104556
H  5.285579 2.104065 -1.258796
O  1.404985 1.015127 0.876592
O  2.885523 2.967293 -0.262514
C  1.35262 1.804157 2.074536
H  1.903741 1.304204 2.872196
H  1.764615 2.794221 1.893125
H  0.303275 1.885407 2.345753
C  3.618038 4.013538 -0.891615
H  3.784438 3.789535 -1.946393
H  3.00165 4.902183 -0.801624
H  4.571808 4.177133 -0.387606
N  4.326191 -0.892921 -0.107497
H  0.144664 0.093749 0.094198
totalener: -1682.24844861 hartree
nucrepener: 2547.22065867 hartree
electener: -4229.46910727 hartree
oneelecener: -7347.14052372 hartree
twoeener: 3117.67141644 hartree
kineticenergy: 1675.48803265 hartree
xcener: -136.326511461317 hartree
chargesum: 1.0000000
charge: 0.024262 0.058425 -0.073512 0.231912 -0.103594 -0.079866 0.189934 0.117385 0.149180 0.149046 -0.275258 0.423783 0.122511 -0.185426 -0.189626 -0.153341 -0.103281 0.196015 0.569710 -0.500890 -0.194841 0.142698 0.171369 0.082572 0.158581 0.220501 0.005841 -0.142117 0.136405 0.127896 -0.366824 -0.289692 -0.086279 0.111424 0.130673 0.101487 -0.144798 0.119151 0.129754 0.119800 -0.325137 0.224166
charge: -0.114711 -0.107559 0.011146 -0.169524 0.033437 0.024223 -0.334436 0.026848 0.041149 0.037092 0.324091 -0.484420 0.020551 0.181832 0.177032 0.409457 0.414383 0.021448 0.847416 -0.335892 -0.142760 0.010891 0.037516 -0.222748 -0.216373 -0.201733 -0.076164 -0.014699 0.029904 0.027588 0.280350 0.309280 -0.022273 0.009163 0.009573 0.012198 -0.023814 0.012297 0.018572 0.011888 0.175028 -0.047247
qa: 0.0243 0.0584 -0.0735 0.2319 -0.1036 -0.0799 0.1899 0.1174 0.1492 0.1490 -0.2753 0.4238 0.1225 -0.1854 -0.1896 -0.1533 -0.1033 0.1960 0.5697 -0.5009 -0.1948 0.1427 0.1714 0.0826 0.1586 0.2205 0.0058 -0.1421 0.1364 0.1279 -0.3668 -0.2897 -0.0863 0.1114 0.1307 0.1015 -0.1448 0.1192 0.1298 0.1198 -0.3251 0.2242
va: 3.9223 3.9793 4.0520 3.9817 3.9968 4.0354 3.9915 1.0486 1.0060 1.0014 2.1785 4.2513 0.9785 1.1102 1.1038 3.5011 3.5623 1.0207 3.7057 1.9261 3.7705 1.0167 1.0239 3.9097 3.7213 4.0395 4.0921 3.8443 1.0002 1.0106 1.9543 2.1276 3.8277 0.9906 0.9984 0.9953 3.8706 0.9855 0.9969 0.9849 3.0870 1.0509
dispcorr: -0.020807129 hartree
energy: -1682.275369773393
dipole: 20.55509 -20.70639 -0.15130 6.91058 -6.18887 0.72171 4.10340 -3.99912 0.10428
magnitude: 0.74473 au
magnitude: 1.89297 debye
temp: 298.15 k
press: 1.00 atm
zeropoint: 0.32037865 hartree
thermalvibcorrection: 0.02065273 hartree
thermalrotcorrection: 0.00141627 hartree
thermaltrasncorrection: 0.00141627 hartree
thermaltotal: -1681.93150585 hartree
thermalcorr: 0.02348527 hartree
nonthermalcorr: 0.32037865 hartree
totalcorr: 0.34386392 hartree
thermalcorrenthalpy: 0.00094421 hartree
totalenthalpy: -1681.93056164 hartree
totalentropycorr: -0.07514999 hartree
gibbsenthalpy: -1682.00571163 hartree
gibbsminuselec: 0.26965814 hartree
