program: Orca
programVersion: 5.0.2
elementType: Cl Cl Cl Cl O N N N C C C C C C C C C C C C C C C C C C H H H H H H H H H H H H H H
charge: 1
multiplicity: 1
keywords: wB97X-D3 TightOpt Freq def2-TZVPP def2/J RIJCOSX TightSCF defgrid3 CHELPG
frequency: 0.00 0.00 0.00 0.00 0.00 0.00 4.86 18.03 20.83 37.17 52.14 60.95 76.58 85.04 96.23 120.52 150.39 174.12 178.50 189.25 203.90 215.25 226.38 252.00 265.30 278.33 316.73 339.29 367.37 384.16 406.91 413.04 420.91 449.36 461.17 465.88 493.57 524.32 545.57 594.01 602.98 616.10 633.61 680.22 681.93 690.19 726.10 740.50 751.03 766.30 789.82 812.65 829.58 840.74 861.30 869.56 882.82 888.19 919.82 923.54 928.73 931.62 937.99 964.58 1006.76 1013.36 1019.42 1041.26 1055.89 1085.54 1107.67 1116.04 1154.96 1156.49 1158.02 1165.94 1187.20 1195.08 1225.86 1253.62 1276.21 1279.11 1294.99 1297.86 1308.92 1332.65 1337.95 1344.20 1396.65 1399.22 1427.30 1435.86 1444.71 1446.88 1488.80 1495.26 1516.62 1535.86 1539.47 1554.69 1585.34 1616.29 1637.38 1661.61 1676.50 1753.14 3099.77 3111.99 3154.33 3191.43 3211.88 3218.71 3242.01 3242.92 3244.05 3244.88 3246.96 3272.00 3294.69 3401.46
frequency: 4.86 18.03 20.83 37.17 52.14 60.95 76.58 85.04 96.23 120.52 150.39 174.12 178.50 189.25 203.90 215.25 226.38 252.00 265.30 278.33 316.73 339.29 367.37 384.16 406.91 413.04 420.91 449.36 461.17 465.88 493.57 524.32 545.57 594.01 602.98 616.10 633.61 680.22 681.93 690.19 726.10 740.50 751.03 766.30 789.82 812.65 829.58 840.74 861.30 869.56 882.82 888.19 919.82 923.54 928.73 931.62 937.99 964.58 1006.76 1013.36 1019.42 1041.26 1055.89 1085.54 1107.67 1116.04 1154.96 1156.49 1158.02 1165.94 1187.20 1195.08 1225.86 1253.62 1276.21 1279.11 1294.99 1297.86 1308.92 1332.65 1337.95 1344.20 1396.65 1399.22 1427.30 1435.86 1444.71 1446.88 1488.80 1495.26 1516.62 1535.86 1539.47 1554.69 1585.34 1616.29 1637.38 1661.61 1676.50 1753.14 3099.77 3111.99 3154.33 3191.43 3211.88 3218.71 3242.01 3242.92 3244.05 3244.88 3246.96 3272.00 3294.69 3401.46
formula: C18H14Cl4N3O
InChI: InChI=1S/C18H14Cl4N3O/c19-13-2-1-12(16(21)7-13)10-26-24-18(9-25-6-5-23-11-25)15-4-3-14(20)8-17(15)22/h1-8,11,24H,9-10H2
40 atoms
Cl -2.772179 -0.208334 2.485129
Cl 0.532994 -2.274667 1.869785
Cl -5.719033 -1.144899 -1.833885
Cl 3.962876 -2.804382 -2.197317
O  0.889621 1.418415 1.978299
N  0.91024 2.7236 -0.573199
N  -0.160151 0.809097 1.401837
N  2.575164 2.203265 -1.92594
C  -0.409437 2.748051 0.002827
C  -0.864398 1.397939 0.504451
C  -2.083361 0.765842 0.003786
C  -2.971112 0.000121 0.780656
C  -2.381131 0.927682 -1.355925
C  1.944745 3.579442 -0.269825
C  2.415562 -0.383471 1.273067
C  1.913526 0.457504 2.401506
C  1.353168 1.919543 -1.583385
C  -4.089218 -0.577619 0.212788
C  -3.480303 0.336931 -1.936271
C  2.955615 3.243406 -1.116277
C  -4.336251 -0.41654 -1.143496
C  1.863523 -1.62294 0.946428
C  3.466624 0.077882 0.487031
C  2.331751 -2.376877 -0.111711
C  3.951482 -0.650888 -0.581295
C  3.37976 -1.878948 -0.872987
H  -0.402155 3.425682 0.858559
H  -1.144679 3.131964 -0.701182
H  -1.721547 1.511552 -1.984322
H  1.855341 4.333857 0.493286
H  1.502351 -0.128993 3.222901
H  2.686603 1.115727 2.786109
H  0.743892 1.138963 -2.016338
H  -4.772006 -1.147303 0.826613
H  -3.68173 0.46078 -2.990575
H  3.931486 3.69338 -1.196172
H  3.906069 1.041861 0.711134
H  1.893312 -3.337163 -0.341811
H  4.755611 -0.266784 -1.191774
H  -0.387045 -0.124827 1.753559
totalener: -2774.41619048 hartree
nucrepener: 2959.74820975 hartree
electener: -5734.16440023 hartree
oneelecener: -9673.07935657 hartree
twoeener: 3938.91495634 hartree
kineticenergy: 2766.90620583 hartree
xcener: -175.080045537993 hartree
chargesum: 1.0000000
charge: -0.005940 -0.048806 0.027220 -0.007374 -0.182319 -0.034106 0.114239 -0.295097 -0.089626 0.188724 0.119550 -0.082306 -0.155348 -0.091559 -0.007560 -0.065179 0.039695 -0.087480 -0.151733 -0.114841 0.087020 -0.008066 -0.146483 -0.086009 -0.067181 0.050657 0.152619 0.153273 0.158744 0.155679 0.172031 0.133669 0.137723 0.138851 0.148584 0.152091 0.133336 0.134543 0.137809 0.190957
charge: 0.479188 0.454158 0.500086 0.464414 0.230186 0.294887 0.342655 0.143070 -0.008299 -0.044319 -0.110748 -0.359934 0.033597 -0.093626 -0.139748 -0.058129 -0.196222 -0.030820 -0.002384 -0.131763 -0.374631 -0.370310 0.028368 -0.046092 -0.002125 -0.383997 0.058589 0.044613 0.035576 0.010788 0.020980 0.043531 0.006972 0.038755 0.039212 0.013794 0.037410 0.032765 0.037704 -0.038149
qa: -0.0059 -0.0488 0.0272 -0.0074 -0.1823 -0.0341 0.1142 -0.2951 -0.0896 0.1887 0.1195 -0.0823 -0.1553 -0.0916 -0.0076 -0.0652 0.0397 -0.0875 -0.1517 -0.1148 0.0870 -0.0081 -0.1465 -0.0860 -0.0672 0.0507 0.1526 0.1533 0.1587 0.1557 0.1720 0.1337 0.1377 0.1389 0.1486 0.1521 0.1333 0.1345 0.1378 0.1910
va: 1.3246 1.3090 1.3391 1.2981 1.9495 3.2465 3.5790 3.0931 3.8650 3.7454 3.4564 4.1322 3.9999 3.8551 3.4461 3.8481 4.0214 3.9613 4.0991 4.0176 4.0685 3.9278 3.9663 3.9772 3.9724 4.0560 0.9970 0.9882 0.9849 1.0015 0.9858 1.0014 1.0002 1.0139 1.0097 1.0041 1.0088 1.0141 1.0115 1.0880
dispcorr: -0.026748397 hartree
energy: -2774.447421666375
dipole: 14.21073 -15.34464 -1.13391 22.96822 -21.35699 1.61123 -0.18934 1.46832 1.27898
magnitude: 2.34895 au
magnitude: 5.97057 debye
temp: 298.15 k
press: 1.00 atm
zeropoint: 0.29470749 hartree
thermalvibcorrection: 0.02010016 hartree
thermalrotcorrection: 0.00141627 hartree
thermaltrasncorrection: 0.00141627 hartree
thermaltotal: -2774.12978147 hartree
thermalcorr: 0.02293270 hartree
nonthermalcorr: 0.29470749 hartree
totalcorr: 0.31764020 hartree
thermalcorrenthalpy: 0.00094421 hartree
totalenthalpy: -2774.12883726 hartree
totalentropycorr: -0.07517949 hartree
gibbsenthalpy: -2774.20401675 hartree
gibbsminuselec: 0.24340491 hartree
