program: Orca
programVersion: 5.0.2
elementType: C C C C C C H H H H H S C C C C H C H C H C N N H N C O O C H H H O H H
charge: 1
multiplicity: 1
keywords: wB97X-D3 TightOpt Freq def2-TZVPP def2/J RIJCOSX TightSCF defgrid3 CHELPG
frequency: 0.00 0.00 0.00 0.00 0.00 0.00 19.96 27.19 39.91 47.58 78.88 88.06 108.73 125.54 150.13 160.86 188.39 202.73 219.97 250.61 287.33 310.53 324.80 351.69 374.07 389.80 413.90 444.55 461.97 475.66 498.55 513.25 521.55 557.98 589.88 630.94 640.38 715.73 719.60 722.11 725.82 741.95 749.41 775.50 779.84 785.17 794.54 850.48 883.51 884.40 941.68 943.06 970.79 984.79 1003.62 1026.73 1027.51 1050.82 1051.91 1058.90 1079.05 1107.56 1122.20 1127.21 1161.40 1169.00 1186.44 1188.89 1206.97 1222.50 1224.90 1236.14 1266.53 1291.23 1328.91 1343.23 1355.77 1364.69 1392.86 1458.66 1493.48 1495.60 1497.83 1499.23 1507.09 1532.15 1548.94 1622.90 1668.44 1669.14 1685.75 1707.63 1723.15 1855.75 3097.49 3191.72 3195.31 3205.87 3210.16 3213.75 3214.95 3222.85 3223.20 3231.17 3237.92 3579.66 3661.60 3686.72
frequency: 19.96 27.19 39.91 47.58 78.88 88.06 108.73 125.54 150.13 160.86 188.39 202.73 219.97 250.61 287.33 310.53 324.80 351.69 374.07 389.80 413.90 444.55 461.97 475.66 498.55 513.25 521.55 557.98 589.88 630.94 640.38 715.73 719.60 722.11 725.82 741.95 749.41 775.50 779.84 785.17 794.54 850.48 883.51 884.40 941.68 943.06 970.79 984.79 1003.62 1026.73 1027.51 1050.82 1051.91 1058.90 1079.05 1107.56 1122.20 1127.21 1161.40 1169.00 1186.44 1188.89 1206.97 1222.50 1224.90 1236.14 1266.53 1291.23 1328.91 1343.23 1355.77 1364.69 1392.86 1458.66 1493.48 1495.60 1497.83 1499.23 1507.09 1532.15 1548.94 1622.90 1668.44 1669.14 1685.75 1707.63 1723.15 1855.75 3097.49 3191.72 3195.31 3205.87 3210.16 3213.75 3214.95 3222.85 3223.20 3231.17 3237.92 3579.66 3661.60 3686.72
formula: C15H14N3O3S
InChI: InChI=1S/C15H14N3O3S/c1-21-15(19)18-14-16-12-8-7-11(9-13(12)17-14)22(20)10-5-3-2-4-6-10/h2-9,16-18H,1H3
36 atoms
C  5.259639 -2.123891 1.170472
C  5.285215 -1.960436 -0.205842
C  4.64596 -0.873512 -0.785146
C  3.970696 0.021659 0.028919
C  3.952063 -0.120676 1.407714
C  4.602423 -1.201993 1.976442
H  5.769717 -2.965025 1.621569
H  5.819157 -2.666322 -0.828139
H  4.692254 -0.715672 -1.856453
H  3.456171 0.624673 2.017053
H  4.605504 -1.323968 3.051694
S  3.155739 1.422456 -0.729048
C  1.488569 0.713706 -0.744629
C  0.552549 1.366891 0.029888
C  1.166469 -0.386011 -1.546411
C  -0.730513 0.855016 -0.019647
H  0.850014 2.222883 0.624167
C  -0.118996 -0.888209 -1.587536
H  1.937446 -0.859468 -2.140936
C  -1.061627 -0.240813 -0.803969
H  -0.3732 -1.740621 -2.201797
C  -2.899691 0.434935 0.239942
N  -1.912716 1.250065 0.620072
N  -2.426503 -0.467601 -0.611111
H  -2.005041 2.021997 1.257839
N  -4.180968 0.521906 0.66231
C  -5.182378 -0.360792 0.230587
O  -4.971391 -1.254255 -0.544797
O  -6.314524 -0.039609 0.80164
C  -7.456626 -0.856277 0.457121
H  -7.268315 -1.888252 0.742412
H  -8.28193 -0.441269 1.023927
H  -7.645455 -0.789163 -0.611386
O  3.084482 2.515785 0.258942
H  -4.444212 1.244747 1.312097
H  -3.030713 -1.174684 -1.011852
totalener: -1368.03182002 hartree
nucrepener: 1805.92869482 hartree
electener: -3173.96051485 hartree
oneelecener: -5436.41511045 hartree
twoeener: 2262.45459560 hartree
kineticenergy: 1362.42437746 hartree
xcener: -111.097671100295 hartree
chargesum: 1.0000000
charge: -0.105942 -0.121217 -0.155808 0.017283 -0.118685 -0.124442 0.144372 0.144055 0.131854 0.128045 0.142569 0.548668 -0.044862 -0.152271 -0.036635 0.121207 0.158134 -0.125884 0.123754 0.054395 0.145608 0.413916 -0.131173 -0.123428 0.169494 -0.180812 0.497200 -0.383051 -0.272003 -0.113944 0.131025 0.140676 0.131462 -0.533247 0.172959 0.206729
charge: 0.010998 0.001033 -0.034670 -0.278912 -0.013810 0.003306 0.028839 0.027854 0.022609 0.025405 0.027569 0.852841 -0.235154 0.000204 0.002691 -0.108513 0.030500 0.021902 0.034777 -0.107521 0.034737 -0.200321 0.417424 0.429405 0.013533 0.353880 -0.531079 0.130459 0.310631 0.020466 0.017359 0.020214 0.017494 -0.353640 0.012739 -0.005250
qa: -0.1059 -0.1212 -0.1558 0.0173 -0.1187 -0.1244 0.1444 0.1441 0.1319 0.1280 0.1426 0.5487 -0.0449 -0.1523 -0.0366 0.1212 0.1581 -0.1259 0.1238 0.0544 0.1456 0.4139 -0.1312 -0.1234 0.1695 -0.1808 0.4972 -0.3831 -0.2720 -0.1139 0.1310 0.1407 0.1315 -0.5332 0.1730 0.2067
va: 3.9657 3.9816 3.9747 3.7414 3.9697 3.9751 0.9956 0.9970 1.0132 1.0289 0.9976 3.6888 3.9770 4.0885 3.9636 3.8417 1.0372 4.0816 1.0138 3.9091 1.0049 4.0709 3.4860 3.4897 1.0180 3.2894 4.2673 2.1165 2.1638 3.8246 0.9928 0.9921 0.9927 1.9107 1.0274 1.0312
dispcorr: -0.015267377 hartree
energy: -1368.052153062687
dipole: -6.08209 1.19826 -4.88383 -8.25161 7.51146 -0.74015 3.03532 -2.47658 0.55874
magnitude: 4.97110 au
magnitude: 12.63552 debye
temp: 298.15 k
press: 1.00 atm
zeropoint: 0.28066290 hartree
thermalvibcorrection: 0.01626894 hartree
thermalrotcorrection: 0.00141627 hartree
thermaltrasncorrection: 0.00141627 hartree
thermaltotal: -1367.75238869 hartree
thermalcorr: 0.01910148 hartree
nonthermalcorr: 0.28066290 hartree
totalcorr: 0.29976438 hartree
thermalcorrenthalpy: 0.00094421 hartree
totalenthalpy: -1367.75144448 hartree
totalentropycorr: -0.06614103 hartree
gibbsenthalpy: -1367.81758550 hartree
gibbsminuselec: 0.23456756 hartree
