program: Orca
programVersion: 5.0.2
elementType: O N N N C C C C C C C C C C C C C C C C C C H H H H H H H H H H H H H H H H H H H H
charge: 1
multiplicity: 1
keywords: wB97X-D3 TightOpt Freq def2-TZVPP def2/J RIJCOSX TightSCF defgrid3 CHELPG
frequency: 0.00 0.00 0.00 0.00 0.00 0.00 15.23 37.80 59.22 72.08 90.20 115.97 130.52 140.68 141.81 153.96 184.71 215.72 234.44 271.78 273.94 298.77 316.49 323.20 362.34 392.16 432.43 451.81 458.87 537.23 555.36 568.23 590.77 596.05 642.38 647.62 661.35 681.66 684.75 693.39 713.90 763.26 785.63 788.45 806.86 812.77 815.11 855.07 898.47 925.55 946.94 966.25 987.01 988.93 993.09 997.45 1008.52 1029.49 1033.07 1053.96 1070.16 1091.39 1104.15 1115.12 1129.55 1134.54 1153.34 1159.02 1176.42 1183.65 1199.23 1219.19 1229.94 1259.96 1286.86 1298.37 1307.14 1331.28 1346.27 1357.95 1370.22 1375.86 1392.32 1399.49 1412.55 1434.66 1449.06 1464.40 1467.79 1478.46 1484.57 1487.71 1493.67 1499.30 1508.63 1513.43 1517.44 1542.45 1567.95 1569.64 1591.97 1598.41 1664.36 1675.97 1701.89 1743.11 3043.77 3073.36 3074.02 3080.03 3083.67 3098.32 3112.42 3124.12 3141.50 3143.25 3153.96 3178.73 3186.12 3204.14 3206.77 3216.13 3227.71 3237.06 3317.83 3683.55
frequency: 15.23 37.80 59.22 72.08 90.20 115.97 130.52 140.68 141.81 153.96 184.71 215.72 234.44 271.78 273.94 298.77 316.49 323.20 362.34 392.16 432.43 451.81 458.87 537.23 555.36 568.23 590.77 596.05 642.38 647.62 661.35 681.66 684.75 693.39 713.90 763.26 785.63 788.45 806.86 812.77 815.11 855.07 898.47 925.55 946.94 966.25 987.01 988.93 993.09 997.45 1008.52 1029.49 1033.07 1053.96 1070.16 1091.39 1104.15 1115.12 1129.55 1134.54 1153.34 1159.02 1176.42 1183.65 1199.23 1219.19 1229.94 1259.96 1286.86 1298.37 1307.14 1331.28 1346.27 1357.95 1370.22 1375.86 1392.32 1399.49 1412.55 1434.66 1449.06 1464.40 1467.79 1478.46 1484.57 1487.71 1493.67 1499.30 1508.63 1513.43 1517.44 1542.45 1567.95 1569.64 1591.97 1598.41 1664.36 1675.97 1701.89 1743.11 3043.77 3073.36 3074.02 3080.03 3083.67 3098.32 3112.42 3124.12 3141.50 3143.25 3153.96 3178.73 3186.12 3204.14 3206.77 3216.13 3227.71 3237.06 3317.83 3683.55
formula: C18H20N3O
InChI: InChI=1S/C18H20N3O/c1-12-19-9-10-21(12)11-13-7-8-16-17(18(13)22)14-5-3-4-6-15(14)20(16)2/h3-6,9-10,13,19H,7-8,11H2,1-2H3
42 atoms
O  -0.38872 -1.673871 1.088605
N  2.75785 1.384291 -0.229249
N  -3.181528 -0.186479 -0.186716
N  -5.151644 -0.93845 -0.564589
C  -1.154207 0.595852 1.094686
C  -0.527918 1.943675 1.470083
C  0.566003 2.405923 0.505551
C  1.500409 1.274157 0.249627
C  1.197471 -0.059539 0.466341
C  -0.089142 -0.50301 0.911346
C  -2.01561 0.7109 -0.174677
C  2.364047 -0.823621 0.098887
C  3.316231 0.110574 -0.329023
C  3.463626 2.596195 -0.579997
C  2.68302 -2.180683 0.094807
C  4.583812 -0.258154 -0.761408
C  -4.366682 0.128105 -0.709393
C  -3.219613 -1.483847 0.294529
C  3.940445 -2.556143 -0.334843
C  4.879253 -1.607558 -0.757209
C  -4.46118 -1.953901 0.058181
C  -4.758757 1.410529 -1.340933
H  -1.797111 0.27845 1.917887
H  -0.089016 1.839291 2.463363
H  -1.305153 2.706429 1.551273
H  1.090384 3.259182 0.937405
H  0.140574 2.757039 -0.441086
H  -1.426558 0.506361 -1.070697
H  -2.407384 1.723661 -0.258485
H  4.330395 2.734559 0.066536
H  3.798907 2.547832 -1.615865
H  2.805918 3.45372 -0.471708
H  1.959516 -2.912416 0.426178
H  5.314509 0.47121 -1.08556
H  -2.344513 -1.927238 0.752141
H  4.210715 -3.603885 -0.343431
H  5.856303 -1.937312 -1.084873
H  -4.907033 -2.907703 0.274888
H  -5.786785 1.357312 -1.691612
H  -4.685685 2.232364 -0.628289
H  -4.118254 1.634767 -2.193577
H  -6.110166 -0.979697 -0.867445
totalener: -937.33517317 hartree
nucrepener: 1754.29717459 hartree
electener: -2691.63234776 hartree
oneelecener: -4735.95555588 hartree
twoeener: 2044.32320811 hartree
kineticenergy: 932.38020353 hartree
xcener: -92.378964805244 hartree
chargesum: 1.0000000
charge: -0.406293 -0.061165 -0.027714 -0.125162 0.080805 -0.239753 -0.143776 0.072219 -0.088405 0.285356 -0.208623 -0.130016 0.105380 -0.193714 -0.126127 -0.145331 0.237121 -0.108315 -0.121497 -0.102200 -0.026917 -0.200865 0.104353 0.116176 0.090354 0.109317 0.109603 0.155401 0.120172 0.134607 0.124507 0.103318 0.137876 0.126013 0.247464 0.132358 0.134109 0.195300 0.090493 0.123572 0.135234 0.184766
charge: 0.117726 0.326477 0.347521 0.417787 -0.057017 0.005048 -0.008092 -0.087274 -0.101985 -0.264564 0.013243 -0.053730 -0.103076 0.021442 0.015329 -0.011870 -0.147726 -0.012388 -0.009378 -0.004195 -0.033571 0.045069 0.042669 0.040237 0.024549 0.035282 0.031580 0.040073 0.032771 0.023845 0.023262 0.018237 0.025678 0.021188 0.008847 0.023989 0.025092 0.027910 0.038280 0.039802 0.041686 0.020246
qa: -0.4063 -0.0612 -0.0277 -0.1252 0.0808 -0.2398 -0.1438 0.0722 -0.0884 0.2854 -0.2086 -0.1300 0.1054 -0.1937 -0.1261 -0.1453 0.2371 -0.1083 -0.1215 -0.1022 -0.0269 -0.2009 0.1044 0.1162 0.0904 0.1093 0.1096 0.1554 0.1202 0.1346 0.1245 0.1033 0.1379 0.1260 0.2475 0.1324 0.1341 0.1953 0.0905 0.1236 0.1352 0.1848
va: 2.0896 3.4349 3.4530 3.5511 3.6974 4.0092 3.9243 3.7358 3.5475 4.0065 3.8552 4.0384 3.8026 3.8855 3.9932 4.0001 3.8091 3.8925 3.9722 3.9967 3.9329 3.9537 1.0219 1.0071 1.0066 1.0105 0.9956 0.9798 0.9873 0.9836 0.9868 1.0037 1.0244 1.0104 1.0247 1.0017 1.0005 0.9854 1.0146 0.9926 0.9900 1.0057
dispcorr: -0.019903629 hartree
energy: -937.357857103998
dipole: -5.49267 0.33009 -5.16258 13.21074 -11.21441 1.99632 -3.35974 2.14266 -1.21708
magnitude: 5.66735 au
magnitude: 14.40525 debye
temp: 298.15 k
press: 1.00 atm
zeropoint: 0.35846507 hartree
thermalvibcorrection: 0.01592805 hartree
thermalrotcorrection: 0.00141627 hartree
thermaltrasncorrection: 0.00141627 hartree
thermaltotal: -936.98063144 hartree
thermalcorr: 0.01876059 hartree
nonthermalcorr: 0.35846507 hartree
totalcorr: 0.37722566 hartree
thermalcorrenthalpy: 0.00094421 hartree
totalenthalpy: -936.97968723 hartree
totalentropycorr: -0.06491105 hartree
gibbsenthalpy: -937.04459828 hartree
gibbsminuselec: 0.31325882 hartree
