program: Orca
programVersion: 5.0.2
elementType: N C C C C C C C C H H H H H H H H H H H H
charge: 1
multiplicity: 1
keywords: wB97X-D3 TightOpt Freq def2-TZVPP def2/J RIJCOSX TightSCF defgrid3 CHELPG
frequency: 0.00 0.00 0.00 0.00 0.00 0.00 48.66 76.57 108.73 245.47 290.44 319.09 353.32 417.14 505.92 603.30 631.97 715.22 778.06 785.82 828.05 860.02 884.02 892.28 957.23 1024.21 1029.81 1042.93 1058.49 1061.39 1113.11 1125.76 1147.81 1197.92 1208.63 1222.57 1268.40 1350.64 1365.60 1368.33 1398.20 1428.33 1442.63 1496.82 1501.99 1516.93 1529.11 1548.84 1654.87 1677.79 1697.40 3068.38 3114.84 3141.15 3167.00 3176.64 3196.70 3196.82 3222.36 3233.26 3240.87 3470.81 3523.29
frequency: 48.66 76.57 108.73 245.47 290.44 319.09 353.32 417.14 505.92 603.30 631.97 715.22 778.06 785.82 828.05 860.02 884.02 892.28 957.23 1024.21 1029.81 1042.93 1058.49 1061.39 1113.11 1125.76 1147.81 1197.92 1208.63 1222.57 1268.40 1350.64 1365.60 1368.33 1398.20 1428.33 1442.63 1496.82 1501.99 1516.93 1529.11 1548.84 1654.87 1677.79 1697.40 3068.38 3114.84 3141.15 3167.00 3176.64 3196.70 3196.82 3222.36 3233.26 3240.87 3470.81 3523.29
formula: C8H12N
InChI: InChI=1S/C8H12N/c1-2-9-8-6-4-3-5-7-8/h3-7H,2,9H2,1H3
21 atoms
N  -1.296057 -0.000739 0.626591
C  0.147681 -0.000307 0.330872
C  -2.186129 0.000552 -0.594282
C  0.79303 1.212185 0.183083
C  0.793553 -1.212394 0.182109
C  -3.644979 -0.00009 -0.198564
C  2.144263 1.204558 -0.125162
C  2.144784 -1.203942 -0.126138
C  2.815569 0.000512 -0.279779
H  -1.90575 0.882935 -1.166873
H  -1.905504 -0.880444 -1.168888
H  -1.522674 -0.814325 1.198232
H  0.263904 2.150213 0.307646
H  0.264826 -2.15075 0.305907
H  -3.910185 -0.888602 0.376221
H  -3.910381 0.886977 0.378359
H  -4.256441 0.000929 -1.09915
H  2.67136 2.141722 -0.240428
H  2.672284 -2.140784 -0.242163
H  3.870665 0.000835 -0.517866
H  -1.522818 0.811497 1.200096
totalener: -366.62061003 hartree
nucrepener: 427.16073748 hartree
electener: -793.78134751 hartree
oneelecener: -1327.97713947 hartree
twoeener: 534.19579196 hartree
kineticenergy: 364.57020168 hartree
xcener: -37.233608051356 hartree
chargesum: 1.0000000
charge: 0.107677 0.160728 -0.071195 -0.199568 -0.199437 -0.211199 -0.065378 -0.065359 -0.123812 0.134155 0.134154 0.176292 0.134278 0.134224 0.093021 0.093017 0.117769 0.157867 0.157868 0.158591 0.176307
charge: 0.541825 -0.114732 0.014102 0.000412 0.000414 0.023083 0.028456 0.028455 0.032111 0.036385 0.036393 0.056354 0.030837 0.030835 0.022651 0.022651 0.039701 0.037762 0.037761 0.038188 0.056357
qa: 0.1077 0.1607 -0.0712 -0.1996 -0.1994 -0.2112 -0.0654 -0.0654 -0.1238 0.1342 0.1342 0.1763 0.1343 0.1342 0.0930 0.0930 0.1178 0.1579 0.1579 0.1586 0.1763
va: 3.7268 3.5999 3.8244 4.0822 4.0821 3.9457 3.9975 3.9975 4.0070 0.9935 0.9935 0.9995 1.0083 1.0083 1.0055 1.0055 1.0079 0.9947 0.9947 0.9939 0.9995
dispcorr: -0.006185852 hartree
energy: -366.627937536733
dipole: -9.43238 7.64712 -1.78526 -0.00007 -0.00058 -0.00065 -0.67583 1.15186 0.47603
magnitude: 1.84764 au
magnitude: 4.69633 debye
temp: 298.15 k
press: 1.00 atm
zeropoint: 0.19029965 hartree
thermalvibcorrection: 0.00575450 hartree
thermalrotcorrection: 0.00141627 hartree
thermaltrasncorrection: 0.00141627 hartree
thermaltotal: -366.42905085 hartree
thermalcorr: 0.00858704 hartree
nonthermalcorr: 0.19029965 hartree
totalcorr: 0.19888669 hartree
thermalcorrenthalpy: 0.00094421 hartree
totalenthalpy: -366.42810664 hartree
totalentropycorr: -0.04271691 hartree
gibbsenthalpy: -366.47082355 hartree
gibbsminuselec: 0.15711399 hartree
