program: Gaussian 09
title: 000044699
version: EM64L-G09RevD.01
frameworkgroup: C1[X(C9H15ClN2O3)]
method: RPBEPBE
basis: SDD
operation: Freq
keyword: #p
keyword: freq=noraman
keyword: PBEPBE/SDD
title: #p freq=noraman PBEPBE/SDD
converged: NO YES NO NO
title: Mulliken charges:
elementType: Cl O O O N N C C C C C C C C C H H H H H H H H H H H H H H H
charge: -0.045242 -0.221210 -0.246274 -0.223401 -0.194055 -0.419472 0.179137 0.157104 -0.360123 0.197899 -0.675836 -0.676394 -0.376812 -0.281089 -0.392888 0.323677 0.237631 0.236063 0.217220 0.247364 0.234161 0.232610 0.247371 0.217901 0.243960 0.243103 0.201825 0.203117 0.245360 0.247293
chargesum: 0.00000
title: Mulliken charges with hydrogens summed into heavy atoms:
elementType: Cl O O O N N C C C C C C C C C
charge: -0.045242 -0.221210 -0.246274 -0.223401 -0.194055 -0.095795 0.179137 0.157104 0.113570 0.197899 0.022909 0.021488 0.110252 0.123854 0.099765
polarizability: 1.61128050e+02 6.97831129e+00 1.20998420e+02 1.62434602e-01 1.32621799e+00 1.04104303e+02
1716.lowfreq: -18.7571 -0.0019 -0.0002 0.0018 3.8543 4.5218 14.5227 20.8758 37.3047
frequency: -18.0184 20.6755 37.1689 49.8889 76.1758 88.6854 109.1779 116.4073 135.6815 196.1383 202.0078 208.3694 232.2630 258.2686 284.2164 295.3479 309.7895 349.3863 423.0299 435.4024 461.8330 473.3247 575.6191 605.1223 618.6389 697.0142 703.8238 728.0126 741.5724 770.4430 852.0684 884.2132 908.7803 934.8824 936.3632 955.8591 982.7880 1004.8236 1037.1160 1047.4238 1065.4045 1087.7113 1143.9807 1173.4493 1174.7911 1176.7938 1201.6464 1225.4561 1266.9124 1282.9277 1284.8675 1311.4958 1339.6764 1355.1419 1364.8233 1373.6206 1383.5603 1392.7535 1400.5640 1454.4304 1457.5664 1458.8447 1463.3657 1476.0979 1476.8622 1484.5451 1491.3816 1649.7994 1713.1990 2923.1573 2974.5613 2977.5064 2988.9421 2991.2012 3009.9247 3023.7189 3053.5181 3067.8824 3088.4147 3092.9398 3095.8290 3102.4169 3107.0337 3606.5199
redmass: 6.7384 5.5284 5.4547 2.2283 5.1278 2.7729 5.3886 2.2159 7.4158 4.8813 1.5918 1.7916 1.2566 2.4227 2.5010 5.3187 2.4952 7.2464 5.6663 3.4844 1.5023 2.3097 4.4653 8.9336 3.2298 8.7487 6.0378 6.1905 6.9954 1.1780 1.5811 2.6406 5.3023 1.5062 2.1043 1.3198 1.9116 1.3026 9.5872 3.4990 2.9233 3.4253 1.3527 2.4903 1.5411 4.0947 2.1092 1.7220 2.7614 1.2280 1.1353 1.1760 1.4694 2.0714 2.0336 1.1872 1.4563 1.3610 1.5552 1.1053 1.0956 1.0469 1.0489 1.0785 1.0691 1.0663 1.0855 10.7294 9.7821 1.0542 1.1070 1.0506 1.0347 1.0352 1.0591 1.0586 1.1154 1.1041 1.1009 1.1002 1.1064 1.1011 1.1005 1.0800
irintensity: 0.4422 0.1029 1.9640 12.9059 2.7424 2.2282 0.3588 3.4360 1.4229 3.2995 0.1719 1.7657 1.8785 4.3926 4.3185 3.6016 0.7736 27.9525 2.6193 0.0710 132.8832 19.5905 11.6300 10.2348 2.1679 7.0078 12.2038 81.0626 4.2477 13.2575 2.2552 7.5765 23.4726 2.1142 0.4302 0.2054 13.6178 0.8879 273.1460 20.5213 52.3200 19.1074 7.3511 22.4776 13.7211 13.9328 6.9570 5.4835 108.1220 3.8483 1.1551 51.0000 71.5585 102.1904 68.1274 18.3998 45.8733 9.9478 43.1538 21.2735 11.3599 7.0520 1.2570 4.9852 9.6621 24.4618 8.7286 514.1793 210.5919 51.1358 47.7655 68.5782 16.0944 22.8538 11.0732 24.8081 43.4449 0.2604 6.9209 35.8381 18.2922 8.7823 21.1918 49.4428
temp: 298.150 k
press: 1.00000 atm
elementType: 17 8 8 8 7 7 6 6 6 6 6 6 6 6 6 1 1 1 1 1 1 1 1 1 1 1 1 1 1 1
symmnumber: 1
zpe: 627938.0 jmol-1
zpe.correction: 0.239169 hartree
zpe.thermalcorrener: 0.255342 hartree
zpe.thermalcorrenthalpy: 0.256286 hartree
zpe.thermalcorrgfe: 0.193144 hartree
zpe.sumelectzpe: -1146.036021 hartree
zpe.sumelectthermal: -1146.019848 hartree
zpe.sumelectthermalent: -1146.018903 hartree
zpe.sumelectthermalfe: -1146.082046 hartree
dipole: -3.8660 0.4878 -1.6692
dipole: 4.2391
quadrupole: -86.4994 -110.3359 -93.4985
quadrupole: 6.5243 -19.2565 -5.7873
quadrupole: 10.2786 -13.5580 3.2794 6.5243 -19.2565 -5.7873
hfenergy: -1146.2751899 hartree
pointgroup: C01 [X(C9H15Cl1N2O3)]
dipole: 1.4902531 -0.1229263 -0.7385992 debye
polarizability: 161.3410407|6.240049|120.7890501|-1.4634708|0.8655126|104.1006831 unknown
InChI: InChI=1S/C9H15ClN2O3/c1-9(2)7(13)12(8(14)11-9)4-3-5-15-6-10/h11H,3-6H2,1-2H3
charge 0 multiplicity 1
30 atoms
Cl -6.337606 0.591451 1.194028
O  1.460789 1.962081 -0.829109
O  1.11049 -2.631152 0.151112
O  -3.853651 0.168848 0.293439
N  0.964645 -0.330944 -0.493136
N  2.806246 -1.015905 0.605841
C  3.049929 0.425082 0.363779
C  1.74917 0.820322 -0.390069
C  -0.364963 -0.393602 -1.111861
C  1.596967 -1.474408 0.111942
C  3.158264 1.232215 1.680949
C  4.279024 0.667744 -0.546465
C  -1.488599 -0.078769 -0.097292
C  -2.86696 -0.154544 -0.758324
C  -5.201513 0.128139 -0.209137
H  3.452749 -1.635521 1.090124
H  -0.487393 -1.412972 -1.520614
H  -0.375983 0.335631 -1.942543
H  4.089176 0.972103 2.216634
H  3.173679 2.311172 1.450854
H  2.300431 1.02568 2.343615
H  4.218653 0.057648 -1.464014
H  4.319406 1.732426 -0.833281
H  5.210945 0.410294 -0.011402
H  -1.450841 -0.801495 0.736816
H  -1.345708 0.934112 0.318847
H  -2.950773 0.576794 -1.593276
H  -3.060756 -1.174309 -1.159714
H  -5.375707 0.873262 -1.008243
H  -5.501811 -0.887782 -0.527699
