program: Orca
programVersion: 5.0.2
elementType: C C C C C C H H C H H C S O O N C H H H C N O C C C H S N C H H H H O H H
charge: 1
multiplicity: 1
keywords: wB97X-D3 TightOpt Freq def2-TZVPP def2/J RIJCOSX TightSCF defgrid3 CHELPG
frequency: 0.00 0.00 0.00 0.00 0.00 0.00 25.93 56.20 60.84 95.43 100.98 116.31 125.04 127.73 144.20 161.35 178.89 182.19 205.36 208.96 253.58 282.26 307.97 322.99 340.01 361.36 368.76 379.61 407.67 423.77 448.02 474.47 522.22 523.81 537.61 543.07 575.03 584.21 601.60 629.10 638.88 655.72 680.24 690.86 704.26 761.68 775.77 781.32 793.74 823.76 859.11 865.06 878.84 886.96 917.74 922.45 939.18 1016.02 1025.12 1061.14 1073.69 1075.50 1082.28 1100.39 1140.93 1158.19 1167.39 1172.46 1198.42 1204.68 1210.06 1227.58 1254.69 1264.94 1308.75 1331.17 1344.37 1355.99 1385.45 1417.95 1437.03 1462.57 1473.19 1476.10 1482.41 1493.44 1497.94 1500.47 1508.73 1535.59 1544.14 1601.35 1652.97 1665.77 1674.13 1693.40 1754.67 3060.73 3077.77 3149.91 3151.10 3171.82 3197.50 3218.41 3228.16 3236.53 3243.26 3247.46 3276.96 3392.56 3605.85
frequency: 25.93 56.20 60.84 95.43 100.98 116.31 125.04 127.73 144.20 161.35 178.89 182.19 205.36 208.96 253.58 282.26 307.97 322.99 340.01 361.36 368.76 379.61 407.67 423.77 448.02 474.47 522.22 523.81 537.61 543.07 575.03 584.21 601.60 629.10 638.88 655.72 680.24 690.86 704.26 761.68 775.77 781.32 793.74 823.76 859.11 865.06 878.84 886.96 917.74 922.45 939.18 1016.02 1025.12 1061.14 1073.69 1075.50 1082.28 1100.39 1140.93 1158.19 1167.39 1172.46 1198.42 1204.68 1210.06 1227.58 1254.69 1264.94 1308.75 1331.17 1344.37 1355.99 1385.45 1417.95 1437.03 1462.57 1473.19 1476.10 1482.41 1493.44 1497.94 1500.47 1508.73 1535.59 1544.14 1601.35 1652.97 1665.77 1674.13 1693.40 1754.67 3060.73 3077.77 3149.91 3151.10 3171.82 3197.50 3218.41 3228.16 3236.53 3243.26 3247.46 3276.96 3392.56 3605.85
formula: C14H14N3O4S2
InChI: InChI=1S/C14H14N3O4S2/c1-8-7-15-14(22-8)16-13(19)11-12(18)9-5-3-4-6-10(9)23(20,21)17(11)2/h3-7,15-16,18H,1-2H3
37 atoms
C  5.217153 -0.096102 -0.363347
C  4.206039 0.851476 -0.393738
C  2.882389 0.45829 -0.235496
C  2.603155 -0.902236 -0.060581
C  3.60567 -1.850323 -0.018853
C  4.922077 -1.437515 -0.173024
H  6.245328 0.217573 -0.483675
H  4.43591 1.898362 -0.534022
C  1.79876 1.450294 -0.248037
H  3.359488 -2.892324 0.135337
H  5.718428 -2.168972 -0.142902
C  0.540306 1.155794 0.235133
S  0.919915 -1.373393 0.092716
O  0.31186 -1.334843 -1.213864
O  0.79594 -2.53753 0.89625
N  0.285491 -0.084194 0.897041
C  0.430214 -0.069047 2.361494
H  -0.250621 0.682307 2.756201
H  0.154994 -1.041114 2.759014
H  1.449984 0.180726 2.663925
C  -0.502151 2.134176 0.096401
N  -1.852313 1.790873 0.392955
O  -0.30397 3.297527 -0.215575
C  -2.591532 0.720997 0.010114
C  -3.19302 -1.252712 -0.943353
C  -4.388086 -0.918733 -0.436101
H  -2.939067 -2.139305 -1.502166
S  -4.25104 0.601085 0.398857
N  -2.199949 -0.31925 -0.69708
C  -5.683896 -1.651204 -0.511827
H  -6.440923 -1.061325 -1.028359
H  -5.544088 -2.580619 -1.060068
H  -6.060174 -1.894573 0.481544
H  -2.387372 2.628086 0.578993
O  2.10738 2.606584 -0.772994
H  1.335951 3.210223 -0.674195
H  -1.231564 -0.507177 -0.993841
totalener: -1803.34355209 hartree
nucrepener: 2373.03747647 hartree
electener: -4176.38102856 hartree
oneelecener: -7167.58722594 hartree
twoeener: 2991.20619738 hartree
kineticenergy: 1796.75551446 hartree
xcener: -132.551642895159 hartree
chargesum: 1.0000000
charge: -0.077246 -0.140902 -0.003623 -0.169808 -0.014893 -0.108654 0.154483 0.152879 0.392360 0.150091 0.156072 -0.168059 0.811120 -0.461198 -0.419734 -0.186078 -0.161267 0.100644 0.140600 0.120148 0.295435 -0.150842 -0.360576 0.243533 -0.023979 -0.034022 0.169137 0.146630 -0.097074 -0.187494 0.118902 0.103798 0.117424 0.172194 -0.258628 0.240003 0.238626
charge: 0.031070 0.051474 -0.080188 -0.197220 0.011989 0.035811 0.036569 0.038286 -0.143779 0.037616 0.036870 -0.238478 0.694914 -0.210417 -0.206746 0.041455 -0.018786 0.018074 0.019903 0.014959 -0.340771 0.325345 0.160696 -0.413441 -0.057677 -0.312647 0.035472 0.844403 0.392340 0.015219 0.033074 0.037925 0.032433 0.013521 0.439141 -0.131226 -0.047182
qa: -0.0772 -0.1409 -0.0036 -0.1698 -0.0149 -0.1087 0.1545 0.1529 0.3924 0.1501 0.1561 -0.1681 0.8111 -0.4612 -0.4197 -0.1861 -0.1613 0.1006 0.1406 0.1201 0.2954 -0.1508 -0.3606 0.2435 -0.0240 -0.0340 0.1691 0.1466 -0.0971 -0.1875 0.1189 0.1038 0.1174 0.1722 -0.2586 0.2400 0.2386
va: 3.9565 4.0270 3.7116 3.9409 3.8878 3.9960 0.9966 1.0154 3.8944 1.0095 0.9949 3.7433 5.8336 2.0161 2.0927 2.9210 3.8834 0.9979 1.0053 0.9949 4.2192 3.2430 2.1468 4.0901 3.9744 3.8605 1.0008 2.7063 3.4796 3.8906 0.9968 1.0049 0.9973 1.0262 2.3048 1.0782 1.0438
dispcorr: -0.021171048 hartree
energy: -1803.373226359623
dipole: -2.01834 0.25084 -1.76750 -5.24804 5.33584 0.08780 2.81873 -2.41150 0.40723
magnitude: 1.81593 au
magnitude: 4.61573 debye
temp: 298.15 k
press: 1.00 atm
zeropoint: 0.28144737 hartree
thermalvibcorrection: 0.01721934 hartree
thermalrotcorrection: 0.00141627 hartree
thermaltrasncorrection: 0.00141627 hartree
thermaltotal: -1803.07172711 hartree
thermalcorr: 0.02005188 hartree
nonthermalcorr: 0.28144737 hartree
totalcorr: 0.30149925 hartree
thermalcorrenthalpy: 0.00094421 hartree
totalenthalpy: -1803.07078290 hartree
totalentropycorr: -0.06721758 hartree
gibbsenthalpy: -1803.13800048 hartree
gibbsminuselec: 0.23522588 hartree
