program: Orca
programVersion: 5.0.2
elementType: C C C C C C H H C H H C S O O N C H H H C N O C C C H S N C H H H H H O H
charge: 1
multiplicity: 1
keywords: wB97X-D3 TightOpt Freq def2-TZVPP def2/J RIJCOSX TightSCF defgrid3 CHELPG
frequency: 0.00 0.00 0.00 0.00 0.00 0.00 21.49 47.35 56.99 70.35 93.34 112.92 127.49 134.47 146.87 170.44 178.26 190.44 195.86 209.58 254.64 271.89 292.22 317.66 344.93 355.77 372.51 385.57 405.28 410.65 422.60 474.62 521.23 538.64 541.11 549.11 583.65 593.59 624.79 634.89 666.76 676.69 686.17 702.55 727.52 771.39 775.19 781.41 789.63 813.66 827.36 835.91 852.06 860.11 897.66 938.38 945.05 1012.81 1023.38 1058.90 1073.68 1075.52 1082.73 1099.85 1113.43 1143.69 1163.74 1174.13 1197.19 1200.94 1210.26 1238.13 1250.10 1268.29 1297.65 1308.51 1340.05 1344.86 1377.41 1410.44 1437.53 1447.09 1464.55 1474.68 1481.85 1493.30 1497.64 1500.50 1511.54 1537.45 1541.22 1598.86 1649.51 1664.00 1674.68 1683.04 1743.38 3057.66 3078.10 3141.59 3151.93 3172.36 3195.55 3216.79 3226.65 3234.54 3240.76 3280.10 3483.83 3530.68 3564.66
frequency: 21.49 47.35 56.99 70.35 93.34 112.92 127.49 134.47 146.87 170.44 178.26 190.44 195.86 209.58 254.64 271.89 292.22 317.66 344.93 355.77 372.51 385.57 405.28 410.65 422.60 474.62 521.23 538.64 541.11 549.11 583.65 593.59 624.79 634.89 666.76 676.69 686.17 702.55 727.52 771.39 775.19 781.41 789.63 813.66 827.36 835.91 852.06 860.11 897.66 938.38 945.05 1012.81 1023.38 1058.90 1073.68 1075.52 1082.73 1099.85 1113.43 1143.69 1163.74 1174.13 1197.19 1200.94 1210.26 1238.13 1250.10 1268.29 1297.65 1308.51 1340.05 1344.86 1377.41 1410.44 1437.53 1447.09 1464.55 1474.68 1481.85 1493.30 1497.64 1500.50 1511.54 1537.45 1541.22 1598.86 1649.51 1664.00 1674.68 1683.04 1743.38 3057.66 3078.10 3141.59 3151.93 3172.36 3195.55 3216.79 3226.65 3234.54 3240.76 3280.10 3483.83 3530.68 3564.66
formula: C14H14N3O4S2
InChI: InChI=1S/C14H14N3O4S2/c1-8-7-15-14(22-8)16-13(19)11-12(18)9-5-3-4-6-10(9)23(20,21)17(11)2/h3-7,15-16,18H,1-2H3
37 atoms
C  5.341238 1.314933 -0.136692
C  4.051194 1.801557 0.002127
C  2.973346 0.925303 -0.04129
C  3.214529 -0.439383 -0.242763
C  4.498076 -0.928349 -0.375629
C  5.564902 -0.041007 -0.320685
H  6.177789 1.999487 -0.097585
H  3.873407 2.857954 0.148526
C  1.596758 1.413556 0.098583
H  4.659019 -1.988885 -0.515982
H  6.575308 -0.413957 -0.4224
C  0.569133 0.563524 0.430235
S  1.826078 -1.525473 -0.360406
O  1.207319 -1.359728 -1.631838
O  2.181017 -2.810713 0.132759
N  0.810716 -0.808435 0.747622
C  1.096823 -1.081951 2.166389
H  0.253132 -0.727196 2.756088
H  1.208776 -2.152521 2.3079
H  2.001229 -0.570381 2.505069
C  -0.789019 0.995131 0.292097
N  -1.726781 -0.041366 0.319906
O  -1.150608 2.161226 0.123448
C  -3.04785 0.123444 0.111601
C  -4.999383 1.229507 -0.26673
C  -5.482021 -0.021856 -0.233748
H  -5.554193 2.1400 -0.425615
S  -4.181317 -1.145913 0.051042
N  -3.631192 1.295205 -0.070783
C  -6.885656 -0.4940 -0.40326
H  -7.235184 -1.020803 0.484438
H  -7.539037 0.359465 -0.572275
H  -6.975109 -1.166199 -1.256404
H  -3.0491 2.131202 -0.075439
H  -1.329463 -0.971959 0.372209
O  1.415586 2.684346 -0.169664
H  0.46719 2.900077 -0.070502
totalener: -1803.35117170 hartree
nucrepener: 2289.81464259 hartree
electener: -4093.16581430 hartree
oneelecener: -7002.10903800 hartree
twoeener: 2908.94322370 hartree
kineticenergy: 1796.74902445 hartree
xcener: -132.550822012039 hartree
chargesum: 1.0000000
charge: -0.079756 -0.154518 0.009441 -0.191086 -0.019996 -0.112550 0.151301 0.146964 0.377455 0.149727 0.153758 -0.119218 0.833851 -0.420606 -0.430069 -0.221060 -0.155298 0.094506 0.144547 0.120646 0.364646 -0.143366 -0.487675 0.239923 -0.014554 -0.041776 0.169623 0.166014 -0.073279 -0.187377 0.119607 0.102814 0.121033 0.216663 0.189344 -0.255104 0.235419
charge: 0.025100 0.046258 -0.084258 -0.190110 0.009460 0.033904 0.034619 0.036518 -0.138809 0.037430 0.035747 -0.226988 0.673502 -0.228324 -0.216569 0.041886 -0.026812 0.015118 0.019683 0.013976 -0.327192 0.348457 0.118786 -0.396325 -0.060466 -0.307969 0.033556 0.856846 0.398546 0.016585 0.033562 0.038067 0.034100 -0.012825 -0.001176 0.438213 -0.122097
qa: -0.0798 -0.1545 0.0094 -0.1911 -0.0200 -0.1125 0.1513 0.1470 0.3775 0.1497 0.1538 -0.1192 0.8339 -0.4206 -0.4301 -0.2211 -0.1553 0.0945 0.1445 0.1206 0.3646 -0.1434 -0.4877 0.2399 -0.0146 -0.0418 0.1696 0.1660 -0.0733 -0.1874 0.1196 0.1028 0.1210 0.2167 0.1893 -0.2551 0.2354
va: 3.9521 4.0374 3.6629 3.9681 3.8897 3.9988 0.9973 1.0162 3.9205 1.0118 0.9952 3.7972 5.9053 2.0805 2.0842 2.9410 3.8770 0.9960 1.0054 0.9940 4.2036 3.3009 2.0227 4.1210 3.9570 3.8770 0.9973 2.7156 3.4775 3.8865 0.9972 1.0050 0.9971 1.0318 1.0400 2.3023 1.0681
dispcorr: -0.018952693 hartree
energy: -1803.378833295119
dipole: -6.16481 2.51587 -3.64894 3.28783 -1.96126 1.32657 4.90625 -3.89966 1.00659
magnitude: 4.01095 au
magnitude: 10.19504 debye
temp: 298.15 k
press: 1.00 atm
zeropoint: 0.28167358 hartree
thermalvibcorrection: 0.01731307 hartree
thermalrotcorrection: 0.00141627 hartree
thermaltrasncorrection: 0.00141627 hartree
thermaltotal: -1803.07701410 hartree
thermalcorr: 0.02014561 hartree
nonthermalcorr: 0.28167358 hartree
totalcorr: 0.30181919 hartree
thermalcorrenthalpy: 0.00094421 hartree
totalenthalpy: -1803.07606989 hartree
totalentropycorr: -0.06762109 hartree
gibbsenthalpy: -1803.14369099 hartree
gibbsminuselec: 0.23514231 hartree
