program: Orca
programVersion: 5.0.2
elementType: O O N C C C C C C C C C C C C C C C H H H H H H H H H H H H H H H H
charge: 1
multiplicity: 1
keywords: wB97X-D3 TightOpt Freq def2-TZVPP def2/J RIJCOSX TightSCF defgrid3 CHELPG
frequency: 0.00 0.00 0.00 0.00 0.00 0.00 23.42 28.11 55.40 80.39 93.71 128.01 139.89 165.15 187.21 220.50 241.02 282.94 301.64 338.04 410.51 429.24 436.26 473.01 486.89 507.01 512.03 529.96 538.86 580.01 623.29 632.13 662.34 705.75 727.30 744.05 769.32 793.17 818.34 831.45 834.89 855.01 909.10 928.40 945.40 978.84 1017.15 1024.36 1026.73 1050.65 1060.46 1079.45 1083.96 1085.06 1116.92 1131.31 1190.48 1198.95 1201.53 1216.93 1220.57 1230.48 1262.52 1292.76 1309.77 1327.44 1337.86 1369.81 1426.90 1430.46 1436.26 1475.08 1477.47 1484.47 1497.76 1515.97 1520.04 1530.26 1542.94 1555.84 1656.48 1662.12 1669.13 1699.52 1708.08 1778.14 2989.22 3061.05 3065.06 3123.41 3127.60 3152.12 3167.52 3207.65 3212.90 3218.34 3227.47 3235.23 3237.35 3248.59 3508.03 3811.87
frequency: 23.42 28.11 55.40 80.39 93.71 128.01 139.89 165.15 187.21 220.50 241.02 282.94 301.64 338.04 410.51 429.24 436.26 473.01 486.89 507.01 512.03 529.96 538.86 580.01 623.29 632.13 662.34 705.75 727.30 744.05 769.32 793.17 818.34 831.45 834.89 855.01 909.10 928.40 945.40 978.84 1017.15 1024.36 1026.73 1050.65 1060.46 1079.45 1083.96 1085.06 1116.92 1131.31 1190.48 1198.95 1201.53 1216.93 1220.57 1230.48 1262.52 1292.76 1309.77 1327.44 1337.86 1369.81 1426.90 1430.46 1436.26 1475.08 1477.47 1484.47 1497.76 1515.97 1520.04 1530.26 1542.94 1555.84 1656.48 1662.12 1669.13 1699.52 1708.08 1778.14 2989.22 3061.05 3065.06 3123.41 3127.60 3152.12 3167.52 3207.65 3212.90 3218.34 3227.47 3235.23 3237.35 3248.59 3508.03 3811.87
formula: C15H16NO2
InChI: InChI=1S/C15H16NO2/c1-10-6-5-9-13(11(10)2)16-14-8-4-3-7-12(14)15(17)18/h3-9,17H,16H2,1-2H3
34 atoms
O  4.018158 -1.665087 -0.287656
O  1.954316 -2.106272 -0.982281
N  0.105083 -0.277443 -0.884331
C  -2.312401 0.172219 -0.584342
C  -1.154131 -0.447181 -0.135513
C  -3.485914 -0.054863 0.155675
C  1.131308 0.557001 -0.230938
C  -1.095899 -1.249123 0.990561
C  -3.433556 -0.856296 1.288167
C  -2.360476 1.033564 -1.819176
C  -2.254474 -1.450639 1.711158
C  2.419485 0.046605 -0.058925
C  -4.789808 0.557145 -0.271416
C  0.792068 1.825065 0.187113
C  3.373352 0.860214 0.546309
C  1.759219 2.620623 0.783266
C  3.04634 2.139398 0.961198
C  2.759786 -1.335946 -0.490458
H  0.568607 -1.204583 -1.042488
H  -0.163328 -1.710159 1.291715
H  -4.342585 -1.022857 1.852044
H  -1.390907 1.425776 -2.132244
H  -2.786204 0.4886 -2.664113
H  -2.990687 1.905592 -1.653912
H  -2.242793 -2.074244 2.594412
H  -5.600828 0.22657 0.373105
H  -4.753421 1.647424 -0.225242
H  -5.044084 0.28341 -1.296492
H  -0.220786 2.187019 0.066844
H  4.374213 0.479208 0.690126
H  1.500033 3.617869 1.11244
H  3.797924 2.760247 1.429098
H  4.158664 -2.572175 -0.587527
H  -0.10299 0.106438 -1.804048
totalener: -786.29982828 hartree
nucrepener: 1275.03432188 hartree
electener: -2061.33415016 hartree
oneelecener: -3579.54899744 hartree
twoeener: 1518.21484729 hartree
kineticenergy: 782.24638729 hartree
xcener: -76.589861680189 hartree
chargesum: 1.0000000
charge: -0.218585 -0.366551 0.121469 -0.168645 0.195701 0.068147 0.004817 -0.212480 -0.112699 -0.308866 -0.067391 -0.123910 -0.214112 -0.135839 -0.058157 -0.061217 -0.104184 0.442667 0.216443 0.129090 0.130612 0.069944 0.146330 0.126947 0.150214 0.095312 0.103142 0.107477 0.153225 0.158739 0.158425 0.159226 0.225594 0.189112
charge: 0.420196 0.150826 0.553065 -0.065744 -0.095444 -0.051261 -0.062553 -0.001140 0.026282 0.030896 0.016097 -0.078264 0.037149 0.019058 0.053501 0.043050 0.030520 -0.397738 -0.022239 0.030752 0.034538 0.008924 0.034960 0.035738 0.034063 0.028223 0.025478 0.027673 0.038629 0.040552 0.039415 0.038515 -0.063843 0.040125
qa: -0.2186 -0.3666 0.1215 -0.1686 0.1957 0.0681 0.0048 -0.2125 -0.1127 -0.3089 -0.0674 -0.1239 -0.2141 -0.1358 -0.0582 -0.0612 -0.1042 0.4427 0.2164 0.1291 0.1306 0.0699 0.1463 0.1269 0.1502 0.0953 0.1031 0.1075 0.1532 0.1587 0.1584 0.1592 0.2256 0.1891
va: 2.2894 2.1259 3.6736 3.8962 3.4417 3.7638 3.9707 4.0937 3.9895 3.9246 3.9955 3.9274 3.9178 4.0224 3.9671 3.9994 3.9744 4.1928 1.0732 1.0155 1.0067 1.0105 0.9875 0.9948 0.9974 1.0111 0.9983 0.9945 0.9965 1.0113 0.9950 0.9948 1.0260 1.0019
dispcorr: -0.015511296 hartree
energy: -786.317755479152
dipole: -15.09869 15.52920 0.43051 6.36576 -5.78456 0.58119 -2.00262 1.57089 -0.43173
magnitude: 0.84233 au
magnitude: 2.14102 debye
temp: 298.15 k
press: 1.00 atm
zeropoint: 0.28578129 hartree
thermalvibcorrection: 0.01314337 hartree
thermalrotcorrection: 0.00141627 hartree
thermaltrasncorrection: 0.00141627 hartree
thermaltotal: -786.01599827 hartree
thermalcorr: 0.01597592 hartree
nonthermalcorr: 0.28578129 hartree
totalcorr: 0.30175721 hartree
thermalcorrenthalpy: 0.00094421 hartree
totalenthalpy: -786.01505406 hartree
totalentropycorr: -0.05902969 hartree
gibbsenthalpy: -786.07408376 hartree
gibbsminuselec: 0.24367172 hartree
