program: Orca
programVersion: 5.0.2
elementType: Cl Cl O O N C C C C C C C C C C C C C C H H H H H H H H H H H H
charge: 1
multiplicity: 1
keywords: wB97X-D3 TightOpt Freq def2-TZVPP def2/J RIJCOSX TightSCF defgrid3 CHELPG
frequency: 0.00 0.00 0.00 0.00 0.00 0.00 13.19 24.59 54.43 66.04 86.58 104.04 127.57 153.47 154.69 200.39 238.16 271.95 288.32 313.96 319.91 332.34 394.83 403.50 407.72 450.94 460.71 510.19 524.10 531.56 535.57 573.16 578.29 584.71 611.32 626.27 674.17 718.09 733.54 757.01 760.47 802.33 817.74 842.75 863.07 877.18 881.63 988.98 992.47 1011.99 1054.25 1064.63 1066.86 1076.46 1117.00 1140.59 1181.31 1191.44 1207.28 1212.63 1239.59 1259.91 1285.13 1288.12 1322.50 1357.80 1400.33 1432.12 1447.18 1470.51 1487.50 1501.69 1514.67 1522.18 1562.91 1588.63 1622.90 1645.71 1648.56 1668.87 1716.77 3072.81 3139.43 3170.05 3184.97 3214.13 3219.30 3239.07 3243.52 3247.57 3677.35 3796.13 3847.06
frequency: 13.19 24.59 54.43 66.04 86.58 104.04 127.57 153.47 154.69 200.39 238.16 271.95 288.32 313.96 319.91 332.34 394.83 403.50 407.72 450.94 460.71 510.19 524.10 531.56 535.57 573.16 578.29 584.71 611.32 626.27 674.17 718.09 733.54 757.01 760.47 802.33 817.74 842.75 863.07 877.18 881.63 988.98 992.47 1011.99 1054.25 1064.63 1066.86 1076.46 1117.00 1140.59 1181.31 1191.44 1207.28 1212.63 1239.59 1259.91 1285.13 1288.12 1322.50 1357.80 1400.33 1432.12 1447.18 1470.51 1487.50 1501.69 1514.67 1522.18 1562.91 1588.63 1622.90 1645.71 1648.56 1668.87 1716.77 3072.81 3139.43 3170.05 3184.97 3214.13 3219.30 3239.07 3243.52 3247.57 3677.35 3796.13 3847.06
formula: C14H12Cl2NO2
InChI: InChI=1S/C14H12Cl2NO2/c1-8-6-7-10(15)13(12(8)16)17-11-5-3-2-4-9(11)14(18)19/h2-7,17-19H,1H3
31 atoms
Cl -1.492893 -2.314386 0.633279
Cl -0.431493 2.535168 -1.438766
O  2.190962 -1.469712 -1.887802
O  4.265111 -1.299951 -1.281121
N  0.232842 -0.238797 -0.532575
C  -1.126112 0.14646 -0.379679
C  1.218389 0.112486 0.30153
C  -3.401091 -0.431079 0.275276
C  -2.052759 -0.755448 0.142203
C  2.593307 -0.257212 0.099628
C  -1.558528 1.406766 -0.783096
C  -3.786555 0.841489 -0.132779
C  0.915792 0.895615 1.444798
C  -2.889832 1.756165 -0.654508
C  3.569731 0.164399 1.058257
C  -4.39568 -1.403543 0.833229
C  1.884472 1.274771 2.319974
C  3.238911 0.908045 2.137048
C  3.027031 -0.998589 -1.00424
H  -4.82754 1.123737 -0.040446
H  -0.111699 1.182064 1.614469
H  -3.2186 2.736942 -0.967846
H  4.608912 -0.124599 0.948883
H  -4.123954 -1.706272 1.845021
H  -5.388909 -0.961575 0.861904
H  -4.439299 -2.309276 0.227316
H  1.608484 1.867257 3.18288
H  3.989646 1.210764 2.852106
H  2.655741 -1.938644 -2.59378
H  4.896744 -0.920022 -0.662215
H  0.437861 -0.856026 -1.297518
totalener: -1666.17412288 hartree
nucrepener: 1665.98025956 hartree
electener: -3332.15438244 hartree
oneelecener: -5576.15280486 hartree
twoeener: 2243.99842242 hartree
kineticenergy: 1661.03323626 hartree
xcener: -114.050615993348 hartree
chargesum: 1.0000000
charge: -0.032256 -0.027221 -0.217872 -0.208087 -0.107923 0.107639 0.136370 -0.014528 -0.047884 -0.120143 -0.052320 -0.065128 -0.130416 -0.079773 -0.113028 -0.196005 -0.038837 -0.123005 0.537496 0.132963 0.146519 0.140306 0.100358 0.108295 0.088756 0.110399 0.158428 0.153403 0.232441 0.240882 0.180169
charge: 0.455200 0.451848 0.461441 0.454843 0.380661 -0.197045 -0.074335 -0.095452 -0.366937 -0.097904 -0.395896 0.027034 0.017946 -0.017088 0.024110 0.025124 0.062578 0.005116 -0.257366 0.036515 0.036287 0.034340 0.025350 0.026783 0.026006 0.027701 0.044069 0.034630 -0.048868 -0.071144 -0.035544
qa: -0.0323 -0.0272 -0.2179 -0.2081 -0.1079 0.1076 0.1364 -0.0145 -0.0479 -0.1201 -0.0523 -0.0651 -0.1304 -0.0798 -0.1130 -0.1960 -0.0388 -0.1230 0.5375 0.1330 0.1465 0.1403 0.1004 0.1083 0.0888 0.1104 0.1584 0.1534 0.2324 0.2409 0.1802
va: 1.3151 1.2958 2.3025 2.3279 3.2360 3.4668 4.1251 3.7649 4.1003 3.7768 4.1243 3.9225 3.9151 4.0001 3.9894 3.9154 3.9837 4.0076 4.0276 1.0025 1.0100 1.0075 1.0233 0.9985 1.0090 0.9978 0.9920 0.9988 1.0182 1.0311 1.0357
dispcorr: -0.015733664 hartree
energy: -1666.192738119850
dipole: -1.02572 3.82760 2.80187 -1.09073 0.44380 -0.64693 7.00216 -7.20384 -0.20168
magnitude: 2.88265 au
magnitude: 7.32712 debye
temp: 298.15 k
press: 1.00 atm
zeropoint: 0.23695535 hartree
thermalvibcorrection: 0.01447151 hartree
thermalrotcorrection: 0.00141627 hartree
thermaltrasncorrection: 0.00141627 hartree
thermaltotal: -1665.93847871 hartree
thermalcorr: 0.01730406 hartree
nonthermalcorr: 0.23695535 hartree
totalcorr: 0.25425941 hartree
thermalcorrenthalpy: 0.00094421 hartree
totalenthalpy: -1665.93753450 hartree
totalentropycorr: -0.06234309 hartree
gibbsenthalpy: -1665.99987759 hartree
gibbsminuselec: 0.19286053 hartree
