program: Gaussian 09
title: 000005202
version: EM64L-G09RevD.01
frameworkgroup: C1[X(C10H12N2O)]
method: RPBEPBE
basis: SDD
operation: Freq
keyword: #p
keyword: freq=noraman
keyword: PBEPBE/SDD
title: #p freq=noraman PBEPBE/SDD
converged: YES YES NO NO
title: Mulliken charges:
elementType: O N N C C C C C C C C C C H H H H H H H H H H H H
charge: -0.445279 -0.405542 -0.572995 0.376757 0.161652 -0.531477 0.221525 -0.431472 -0.392697 -0.591468 -0.316054 0.279889 -0.349248 0.230931 0.195669 0.267909 0.302560 0.219830 0.199493 0.222232 0.227988 0.247049 0.275962 0.259518 0.347268
chargesum: 0.00000
title: Mulliken charges with hydrogens summed into heavy atoms:
elementType: O N N C C C C C C C C C C
charge: -0.098010 -0.102982 -0.037514 0.376757 0.161652 -0.104877 0.221525 -0.163563 0.026625 -0.369236 -0.088067 0.279889 -0.102199
polarizability: 1.63007541e+02 -9.95673448e+00 1.44097992e+02 9.16503223e+00 5.63751556e+00 6.76237531e+01
1716.lowfreq: -16.4036 -11.7882 -10.4829 -0.0007 -0.0006 -0.0004 40.2582 70.1553 82.2074
frequency: 40.0366 70.0946 82.1977 145.4762 188.2454 215.0773 215.4003 316.7771 326.3323 329.8779 359.9642 404.2521 421.3784 442.5912 483.1139 493.7042 577.0368 586.6878 597.8123 643.1558 706.4474 743.9861 758.5168 788.1041 795.0855 804.7021 818.8574 829.3576 922.1175 929.6835 938.3270 1011.3422 1053.5183 1091.9615 1095.7141 1117.5193 1120.8241 1145.0046 1204.3044 1220.1415 1243.9514 1251.3491 1282.4378 1303.6202 1314.2587 1337.8389 1376.5759 1395.2367 1440.1576 1462.0749 1466.2274 1480.2011 1491.8833 1562.4550 1600.7364 1635.6528 1636.3717 2884.2135 2959.3299 3026.6654 3051.7874 3112.3493 3136.7330 3173.8872 3218.5861 3457.0787 3585.0913 3585.9810 3616.8872
redmass: 2.9472 2.4554 3.1727 5.4205 2.8996 1.2232 3.6298 2.0259 1.6188 3.6062 3.7461 5.7419 2.8267 5.6700 1.2056 4.0507 1.8170 2.0183 3.0074 3.7404 4.5411 3.5347 3.1567 1.3459 1.5835 1.5381 3.5755 1.8633 4.1233 1.3315 1.8166 2.2018 2.5149 2.2855 1.8393 1.4750 1.4063 1.2872 1.7067 1.4337 2.9518 1.4202 1.1887 1.8184 1.7195 1.8824 1.3923 4.4432 2.9840 3.6407 1.1491 4.2350 1.0881 6.1152 6.2249 5.1833 1.1645 1.0713 1.0664 1.0866 1.0972 1.0914 1.0896 1.0954 1.0983 1.0448 1.0976 1.0660 1.0809
irintensity: 1.8212 3.9816 0.4183 5.3863 4.1565 44.6606 3.1285 34.0609 97.4684 13.4192 26.6529 4.7092 16.7451 1.3406 106.7830 7.2965 155.0976 70.2083 55.4984 9.3473 6.6775 0.6069 4.0830 9.4235 57.4108 4.9994 14.1634 33.7888 23.7740 0.1218 2.7244 2.0630 23.7358 10.8171 70.7193 67.3837 36.5998 131.9950 7.5689 6.6956 18.0175 6.9795 2.1556 0.5260 1.1001 16.2034 13.7432 21.8977 11.8556 44.3733 9.8888 68.2724 5.5862 0.6668 22.3292 24.1282 44.2694 103.0648 39.0730 22.2840 38.7336 18.4272 11.0480 8.5364 1.1501 0.9282 0.1672 27.5786 60.4686
temp: 298.150 k
press: 1.00000 atm
elementType: 8 7 7 6 6 6 6 6 6 6 6 6 6 1 1 1 1 1 1 1 1 1 1 1 1
symmnumber: 1
zpe: 533082.0 jmol-1
zpe.correction: 0.203040 hartree
zpe.thermalcorrener: 0.215256 hartree
zpe.thermalcorrenthalpy: 0.216200 hartree
zpe.thermalcorrgfe: 0.164378 hartree
zpe.sumelectzpe: -572.034889 hartree
zpe.sumelectthermal: -572.022673 hartree
zpe.sumelectthermalent: -572.021729 hartree
zpe.sumelectthermalfe: -572.073551 hartree
dipole: -1.2571 0.8434 0.4963
dipole: 1.5931
quadrupole: -83.7062 -55.7626 -80.2091
quadrupole: 10.8800 -1.5684 3.1364
quadrupole: -10.4802 17.4634 -6.9831 10.8800 -1.5684 3.1364
hfenergy: -572.2379291 hartree
pointgroup: C01 [X(C10H12N2O1)]
dipole: -0.5119705 -0.3121957 -0.1823905 debye
dipolederiv: -0.3976941 -0.5028497 -0.0647849 -0.7064755 -1.1831303 0.0306052 -0.0754541 0.0123063 -0.41224 -0.4943984 0.3045127 0.0227567 -0.0387648 -0.6271473 -0.0137903 0.0384871 -0.1001176 -0.2777972 -0.9089115 0.0810395 0.1617606 0.0678146 -0.4879372 0.1299031 0.1539677 0.1249256 -0.2983564 0.1440145 -0.2099412 -0.0454491 -0.0385673 -0.1628004 0.0089945 -0.0643123 0.0496788 -0.1518498 0.2304034 0.3685399 0.0083148 -0.0339435 -0.0371864 0.0121046 -0.0318665 -0.0638563 0.0146018 0.0991216 0.0613251 -0.009488 0.0307528 0.0682793 0.0670007 -0.1276844 0.1005417 0.1093189 -0.2507625 0.0958997 0.0462925 0.4525528 0.3440293 -0.0254375 0.0807345 0.0122975 -0.0086174 0.1181442 -0.4520214 -0.0891136 -0.3008035 0.262104 0.078506 -0.0844527 0.1265512 -0.1608763 0.6303092 -0.0931399 -0.0827043 -0.2070835 0.3773124 -0.000822 0.0167677 -0.0448594 0.1684389 -0.1703378 -0.2801622 -0.0386963 -0.0133462 -0.1322137 -0.0011288 -0.0166531 0.0555236 -0.2175467 0.2749983 -0.0023159 -0.0721181 0.1428836 0.0807628 0.0033546 -0.0600293 0.0226446 -0.1510379 0.2786883 0.3976623 0.010408 0.6567299 1.1584651 0.0124163 0.0230051 0.0383056 0.0556535 -0.030191 0.0509754 -0.0278944 -0.3237012 -0.2600122 0.0434446 -0.0598776 -0.0153927 -0.1906583 -0.0643151 -0.0618998 0.0745925 -0.0964089 -0.011259 0.0683713 0.0419245 0.0415686 0.0408243 0.0331855 -0.021473 -0.0433918 0.0587582 -0.0677889 -0.1450968 0.0002333 -0.0966569 -0.0598795 0.0217558 -0.0747847 0.0284272 -0.0731779 0.0327301 -0.0046343 0.0271838 -0.0037084 0.1933226 0.1429299 0.0163319 0.0332392 -0.0017432 0.2203009 -0.0128019 0.0357148 -0.0075711 0.3380037 0.0179647 -0.0050968 -0.0463964 -0.0337735 -0.0313937 -0.1262559 -0.0060738 -0.0983736 -0.0585603 -0.2418577 -0.0459013 0.1248886 -0.1009857 -0.0416314 0.0770512 0.1028059 0.0317584 -0.0157756 0.0455444 0.0873309 0.0310552 0.0732075 -0.0866446 -0.0311845 0.0359329 -0.038099 0.1580391 0.0163355 0.0718162 0.0317931 0.1099486 -0.0527549 -0.0392434 0.0370396 -0.033842 0.1607285 -0.0685244 -0.0231872 0.0380542 -0.0328416 0.0976633 -0.0017027 0.039256 -0.002653 0.1677844 0.2445483 0.094314 -0.0396542 0.2266853 0.1423242 0.0550972 -0.1125682 0.0441353 0.0593134 0.2041638 -0.0309884 -0.1142662 0.0426457 0.0883694 -0.1570973 -0.052546 -0.1191452 0.1777969 0.124885 0.1740138 0.0623749 0.1396373 0.3095592 -0.0276536 0.058465 -0.0359618 0.3593692 unknown
polarizability: 163.8388197|8.7001922|143.4426081|-9.7813313|3.7150909|67.4478582 unknown
InChI: InChI=1S/C10H12N2O/c11-4-3-7-6-12-10-2-1-8(13)5-9(7)10/h1-2,5-6,12-13H,3-4,11H2
charge 0 multiplicity 1
25 atoms
O  2.756608 2.494399 -0.017317
N  0.159609 -2.452034 -0.048277
N  -4.207934 1.657466 -0.298649
C  -1.226114 -0.672154 0.35995
C  0.127666 -0.176995 0.168584
C  -2.465602 0.145694 0.626612
C  0.975132 -1.312563 -0.084595
C  -1.159672 -2.060753 0.220969
C  -2.987671 0.894953 -0.628692
C  0.70421 1.123205 0.196817
C  2.363259 -1.178966 -0.309866
C  2.089121 1.247413 -0.026393
C  2.91576 0.113864 -0.279732
H  -3.28711 -0.492564 0.999638
H  -2.261716 0.893089 1.422787
H  -1.95929 -2.795835 0.299011
H  0.477087 -3.409184 -0.179478
H  -3.244434 0.148129 -1.402673
H  -2.158342 1.515091 -1.047451
H  0.083418 2.007718 0.391263
H  3.002823 -2.047288 -0.502777
H  3.984072 0.278522 -0.446985
H  -4.729384 2.003117 -1.109359
H  -4.066853 2.388107 0.406409
H  2.117955 3.22617 0.168604
