program: Orca
programVersion: 5.0.2
elementType: Cl N N C C C C C C C C C C C C C C C C C C C C C C C C C H H H H H H H H H H H H H H H H H H H H H H H H H H H H
charge: 1
multiplicity: 1
keywords: wB97X-D3 TightOpt Freq def2-TZVPP def2/J RIJCOSX TightSCF defgrid3 CHELPG
frequency: 0.00 0.00 0.00 0.00 0.00 0.00 12.00 19.00 24.06 29.50 34.86 42.76 47.29 61.57 66.77 80.19 125.05 139.85 186.71 195.51 215.08 219.26 232.43 250.35 264.11 290.40 311.75 331.48 343.17 366.52 399.67 408.81 418.19 428.05 435.75 453.11 466.59 496.51 497.55 520.15 531.57 547.05 577.92 625.20 634.90 643.26 645.00 667.19 722.40 728.88 730.01 758.91 762.99 795.00 810.40 836.89 839.96 858.58 871.29 878.68 881.86 888.16 902.83 915.71 932.21 961.65 965.49 969.58 987.75 996.68 1005.12 1020.60 1024.16 1024.39 1031.40 1034.11 1039.57 1041.86 1045.39 1047.55 1062.15 1068.00 1075.70 1089.92 1107.31 1118.63 1135.60 1138.62 1141.65 1151.68 1171.95 1187.09 1198.69 1204.62 1208.42 1208.60 1214.76 1230.28 1231.32 1234.83 1252.79 1285.89 1291.00 1308.68 1322.82 1327.01 1334.26 1340.55 1357.46 1359.63 1361.29 1368.53 1380.62 1384.98 1390.56 1411.97 1427.29 1430.40 1434.55 1449.27 1457.75 1463.79 1476.60 1487.74 1490.21 1497.55 1500.24 1507.03 1510.42 1516.36 1517.41 1549.17 1550.43 1552.26 1656.59 1671.13 1673.95 1684.91 1689.72 1692.11 2932.87 2939.19 2969.23 3070.19 3098.76 3104.06 3107.17 3139.94 3144.40 3146.16 3156.27 3158.96 3160.73 3166.54 3175.77 3188.02 3195.10 3195.59 3201.33 3203.52 3204.18 3211.32 3219.31 3226.67 3229.33 3229.94 3232.58 3464.75
frequency: 12.00 19.00 24.06 29.50 34.86 42.76 47.29 61.57 66.77 80.19 125.05 139.85 186.71 195.51 215.08 219.26 232.43 250.35 264.11 290.40 311.75 331.48 343.17 366.52 399.67 408.81 418.19 428.05 435.75 453.11 466.59 496.51 497.55 520.15 531.57 547.05 577.92 625.20 634.90 643.26 645.00 667.19 722.40 728.88 730.01 758.91 762.99 795.00 810.40 836.89 839.96 858.58 871.29 878.68 881.86 888.16 902.83 915.71 932.21 961.65 965.49 969.58 987.75 996.68 1005.12 1020.60 1024.16 1024.39 1031.40 1034.11 1039.57 1041.86 1045.39 1047.55 1062.15 1068.00 1075.70 1089.92 1107.31 1118.63 1135.60 1138.62 1141.65 1151.68 1171.95 1187.09 1198.69 1204.62 1208.42 1208.60 1214.76 1230.28 1231.32 1234.83 1252.79 1285.89 1291.00 1308.68 1322.82 1327.01 1334.26 1340.55 1357.46 1359.63 1361.29 1368.53 1380.62 1384.98 1390.56 1411.97 1427.29 1430.40 1434.55 1449.27 1457.75 1463.79 1476.60 1487.74 1490.21 1497.55 1500.24 1507.03 1510.42 1516.36 1517.41 1549.17 1550.43 1552.26 1656.59 1671.13 1673.95 1684.91 1689.72 1692.11 2932.87 2939.19 2969.23 3070.19 3098.76 3104.06 3107.17 3139.94 3144.40 3146.16 3156.27 3158.96 3160.73 3166.54 3175.77 3188.02 3195.10 3195.59 3201.33 3203.52 3204.18 3211.32 3219.31 3226.67 3229.33 3229.94 3232.58 3464.75
formula: C25H28ClN2
InChI: InChI=1S/C25H28ClN2/c1-20-6-5-7-21(18-20)19-27-14-16-28(17-15-27)25(22-8-3-2-4-9-22)23-10-12-24(26)13-11-23/h2-13,18,25,27H,14-17,19H2,1H3
56 atoms
Cl -4.552855 4.705327 0.463703
N  -0.468033 -0.626254 -0.010217
N  2.349805 -0.879648 -0.519968
C  0.153013 -1.932195 -0.074261
C  0.473632 0.326999 0.541408
C  1.356957 -1.895078 -0.991358
C  1.687551 0.453218 -0.352606
C  -1.752103 -0.623208 0.70962
C  3.573481 -0.824671 -1.399682
C  -2.415765 0.740279 0.636578
C  -2.679867 -1.70769 0.190733
C  4.661268 -0.001933 -0.777357
C  -3.115592 1.216674 1.737051
C  -2.387809 1.511919 -0.52039
C  -3.167456 -2.672367 1.061452
C  -3.06706 -1.747834 -1.146122
C  5.401827 -0.530188 0.278517
C  4.923046 1.284345 -1.225847
C  -3.779831 2.431546 1.692102
C  -3.041942 2.730271 -0.579317
C  -4.030238 -3.662619 0.610576
C  -3.920261 -2.73866 -1.599787
C  6.392252 0.211462 0.908391
C  -3.737832 3.184558 0.530544
C  -4.406049 -3.698747 -0.721265
C  5.913647 2.035605 -0.60971
C  6.632125 1.505951 0.446926
C  7.20639 -0.362343 2.032497
H  -0.548996 -2.660139 -0.476357
H  0.455561 -2.298311 0.924386
H  0.788998 0.047423 1.563432
H  0.009576 1.308979 0.613534
H  1.065444 -1.603958 -2.000048
H  1.863098 -2.858695 -1.026743
H  2.425925 1.137505 0.059499
H  1.401912 0.78582 -1.350387
H  -1.569966 -0.840797 1.77415
H  3.247728 -0.421838 -2.357739
H  3.885444 -1.858663 -1.546833
H  -3.152116 0.629526 2.647399
H  -1.841721 1.160776 -1.387159
H  -2.876013 -2.650096 2.105519
H  -2.703134 -0.997316 -1.836583
H  5.22497 -1.551617 0.605554
H  4.365662 1.698714 -2.057797
H  -4.324859 2.795296 2.552154
H  -3.017918 3.327529 -1.48052
H  -4.407357 -4.404086 1.302884
H  -4.216853 -2.758016 -2.640594
H  -5.07918 -4.4682 -1.076008
H  6.125944 3.037425 -0.95897
H  7.40401 2.101496 0.919509
H  8.245259 -0.492014 1.726089
H  7.203348 0.303412 2.895719
H  6.828245 -1.332646 2.350335
H  2.669443 -1.166087 0.406556
totalener: -1539.09230676 hartree
nucrepener: 2607.23495076 hartree
electener: -4146.32725752 hartree
oneelecener: -7254.75865392 hartree
twoeener: 3108.43139640 hartree
kineticenergy: 1533.39215102 hartree
xcener: -130.524107726119 hartree
chargesum: 1.0000000
charge: -0.046496 -0.161172 0.208428 -0.151399 -0.170632 -0.136959 -0.146344 0.161399 -0.120457 0.073875 0.011061 0.015538 -0.179503 -0.230247 -0.157287 -0.199885 -0.213812 -0.163911 -0.131277 -0.147266 -0.128688 -0.136462 -0.012760 0.083742 -0.105054 -0.092574 -0.123705 -0.193305 0.127889 0.116124 0.119543 0.133610 0.136589 0.133148 0.154034 0.133918 0.113413 0.147492 0.155396 0.114999 0.119452 0.113006 0.124489 0.116776 0.128146 0.131730 0.129305 0.139191 0.138438 0.142021 0.148931 0.136771 0.115050 0.105898 0.080096 0.139700
charge: 0.424847 0.203618 0.453701 -0.073287 -0.073457 0.010277 0.014983 -0.107669 0.021546 -0.075078 -0.076743 -0.113143 0.007697 -0.008660 -0.006330 -0.001508 -0.005333 -0.006125 -0.020204 -0.028201 -0.001829 -0.004157 -0.068126 -0.391980 -0.000273 0.010235 0.026035 0.034009 0.043291 0.019730 0.020150 0.042846 0.039487 0.034020 0.037469 0.037568 0.035540 0.042574 0.040826 0.027846 0.019059 0.022256 0.023346 0.022992 0.025839 0.029124 0.026837 0.026276 0.025693 0.026382 0.031839 0.034650 0.030782 0.027857 0.020001 0.040874
qa: -0.0465 -0.1612 0.2084 -0.1514 -0.1706 -0.1370 -0.1463 0.1614 -0.1205 0.0739 0.0111 0.0155 -0.1795 -0.2302 -0.1573 -0.1999 -0.2138 -0.1639 -0.1313 -0.1473 -0.1287 -0.1365 -0.0128 0.0837 -0.1051 -0.0926 -0.1237 -0.1933 0.1279 0.1161 0.1195 0.1336 0.1366 0.1331 0.1540 0.1339 0.1134 0.1475 0.1554 0.1150 0.1195 0.1130 0.1245 0.1168 0.1281 0.1317 0.1293 0.1392 0.1384 0.1420 0.1489 0.1368 0.1150 0.1059 0.0801 0.1397
va: 1.2592 2.7886 3.5584 3.9273 3.9401 3.8593 3.8453 3.6440 3.8042 3.5027 3.5490 3.5370 4.0637 3.9690 3.9995 3.9819 3.9929 3.9726 4.0272 4.0649 3.9926 4.0078 3.8774 3.9859 3.9518 3.9720 3.9913 3.9055 1.0151 1.0127 1.0149 1.0125 1.0096 1.0104 1.0066 1.0091 1.0067 1.0032 0.9980 1.0154 1.0319 1.0163 1.0139 1.0167 1.0092 1.0113 1.0122 0.9996 0.9995 0.9972 0.9965 1.0008 0.9961 0.9983 1.0090 1.0291
dispcorr: -0.029187393 hartree
energy: -1539.125655971699
dipole: 35.22155 -30.83728 4.38426 -24.21574 22.19646 -2.01928 -0.28485 -0.11746 -0.40231
magnitude: 4.84367 au
magnitude: 12.31162 debye
temp: 298.15 k
press: 1.00 atm
zeropoint: 0.48436770 hartree
thermalvibcorrection: 0.02180636 hartree
thermalrotcorrection: 0.00141627 hartree
thermaltrasncorrection: 0.00141627 hartree
thermaltotal: -1538.61664937 hartree
thermalcorr: 0.02463890 hartree
nonthermalcorr: 0.48436770 hartree
totalcorr: 0.50900660 hartree
thermalcorrenthalpy: 0.00094421 hartree
totalenthalpy: -1538.61570516 hartree
totalentropycorr: -0.07773153 hartree
gibbsenthalpy: -1538.69343670 hartree
gibbsminuselec: 0.43221928 hartree
