program: Orca
programVersion: 5.0.2
elementType: Cl O N N N C C C C C C C C C C C C C C C C C C H H H H H H H H H H H H H H H H H H H
charge: 1
multiplicity: 1
keywords: wB97X-D3 TightOpt Freq def2-TZVPP def2/J RIJCOSX TightSCF defgrid3 CHELPG
frequency: 0.00 0.00 0.00 0.00 0.00 0.00 32.74 38.79 43.97 87.78 93.67 112.53 128.59 173.93 189.28 196.12 228.15 258.42 300.40 319.85 332.35 340.77 362.95 376.06 393.21 413.88 425.71 443.71 464.15 490.58 492.32 510.86 543.44 563.53 578.44 592.07 630.56 642.08 655.16 675.22 721.45 767.31 785.63 790.26 794.07 817.88 831.52 838.01 873.06 883.92 896.96 918.67 926.55 950.87 955.44 997.37 1002.06 1018.72 1024.40 1028.76 1035.36 1057.68 1059.22 1071.20 1104.75 1124.87 1138.04 1142.21 1168.36 1179.03 1182.60 1209.27 1216.45 1236.98 1249.64 1265.77 1283.46 1291.93 1296.61 1308.81 1319.73 1322.05 1346.66 1347.50 1377.78 1394.14 1403.58 1425.69 1428.39 1438.65 1447.89 1454.06 1472.61 1474.30 1488.36 1494.99 1507.09 1509.20 1509.67 1517.26 1534.34 1545.95 1652.33 1661.77 1678.97 1689.72 1730.59 3060.55 3065.80 3093.07 3095.52 3106.46 3159.08 3165.21 3172.80 3176.87 3195.65 3197.32 3209.37 3217.65 3225.60 3226.30 3226.66 3235.32 3239.26 3477.89
frequency: 32.74 38.79 43.97 87.78 93.67 112.53 128.59 173.93 189.28 196.12 228.15 258.42 300.40 319.85 332.35 340.77 362.95 376.06 393.21 413.88 425.71 443.71 464.15 490.58 492.32 510.86 543.44 563.53 578.44 592.07 630.56 642.08 655.16 675.22 721.45 767.31 785.63 790.26 794.07 817.88 831.52 838.01 873.06 883.92 896.96 918.67 926.55 950.87 955.44 997.37 1002.06 1018.72 1024.40 1028.76 1035.36 1057.68 1059.22 1071.20 1104.75 1124.87 1138.04 1142.21 1168.36 1179.03 1182.60 1209.27 1216.45 1236.98 1249.64 1265.77 1283.46 1291.93 1296.61 1308.81 1319.73 1322.05 1346.66 1347.50 1377.78 1394.14 1403.58 1425.69 1428.39 1438.65 1447.89 1454.06 1472.61 1474.30 1488.36 1494.99 1507.09 1509.20 1509.67 1517.26 1534.34 1545.95 1652.33 1661.77 1678.97 1689.72 1730.59 3060.55 3065.80 3093.07 3095.52 3106.46 3159.08 3165.21 3172.80 3176.87 3195.65 3197.32 3209.37 3217.65 3225.60 3226.30 3226.66 3235.32 3239.26 3477.89
formula: C18H19ClN3O
InChI: InChI=1S/C18H19ClN3O/c1-21-8-10-22(11-9-21)18-14-12-13(19)6-7-16(14)23-17-5-3-2-4-15(17)20-18/h2-7,12,21H,8-11H2,1H3
42 atoms
Cl -3.949129 -2.869404 -0.767143
O  -0.634254 1.392304 1.508046
N  1.192357 -1.29709 -0.919304
N  3.688463 -1.756421 0.453361
N  1.007887 0.987852 -0.776021
C  2.45598 -1.088743 -1.594456
C  1.301158 -2.341587 0.081501
C  3.567168 -0.713676 -0.625013
C  2.364639 -2.001359 1.119422
C  0.464375 -0.143169 -0.571237
C  4.74782 -1.411945 1.436893
C  -0.903413 -0.392963 -0.059147
C  -1.410091 0.396191 0.968216
C  0.36713 2.209193 -0.522331
C  -1.701191 -1.400785 -0.598183
C  -0.415793 2.430977 0.609951
C  -2.676765 0.166469 1.478682
C  -2.968235 -1.619513 -0.092983
C  -3.45687 -0.846819 0.953181
C  0.605814 3.281517 -1.377389
C  -0.94632 3.675982 0.887127
C  0.061349 4.526517 -1.119108
C  -0.708514 4.72808 0.018037
H  2.353681 -0.285875 -2.31901
H  2.711056 -2.006022 -2.134007
H  1.53862 -3.287916 -0.413533
H  0.353989 -2.481194 0.596786
H  4.535445 -0.643151 -1.118611
H  3.336028 0.230013 -0.133004
H  2.110338 -1.083688 1.65188
H  2.503321 -2.805629 1.840985
H  5.692251 -1.287269 0.913013
H  4.828938 -2.210478 2.170394
H  4.471992 -0.482139 1.928259
H  -1.33165 -2.005255 -1.415648
H  -3.039502 0.789075 2.284997
H  -4.447633 -1.035041 1.343372
H  1.228346 3.116622 -2.247213
H  -1.537857 3.804549 1.78376
H  0.248667 5.346091 -1.799816
H  -1.12228 5.704592 0.230835
H  3.959219 -2.628628 -0.00098
totalener: -1396.87368044 hartree
nucrepener: 2068.00055013 hartree
electener: -3464.87423058 hartree
oneelecener: -5995.91484352 hartree
twoeener: 2531.04061295 hartree
kineticenergy: 1391.25199679 hartree
xcener: -113.151964759897 hartree
chargesum: 1.0000000
charge: -0.035396 -0.335310 -0.126936 0.156482 -0.351192 -0.096477 -0.127518 -0.172567 -0.166233 0.302310 -0.154544 0.002982 0.146183 0.137359 -0.239948 0.151476 -0.146159 0.084938 -0.099928 -0.212525 -0.140860 -0.093468 -0.105116 0.119707 0.132769 0.130713 0.142838 0.144639 0.158150 0.147154 0.147395 0.134977 0.134159 0.137746 0.138592 0.139128 0.139816 0.118941 0.132413 0.137838 0.140888 0.144585
charge: 0.431522 0.306014 0.237227 0.441479 0.182017 -0.055310 -0.055106 0.017495 0.017194 -0.230356 0.072322 -0.082809 -0.179083 -0.171054 -0.011532 -0.178507 0.019037 -0.398656 -0.003343 0.004127 0.001884 -0.006029 0.000932 0.042703 0.028876 0.031948 0.043669 0.033248 0.036239 0.041933 0.035018 0.029766 0.028791 0.034180 0.031550 0.036223 0.034108 0.025383 0.030256 0.026790 0.027442 0.042413
qa: -0.0354 -0.3353 -0.1269 0.1565 -0.3512 -0.0965 -0.1275 -0.1726 -0.1662 0.3023 -0.1545 0.0030 0.1462 0.1374 -0.2399 0.1515 -0.1462 0.0849 -0.0999 -0.2125 -0.1409 -0.0935 -0.1051 0.1197 0.1328 0.1307 0.1428 0.1446 0.1581 0.1472 0.1474 0.1350 0.1342 0.1377 0.1386 0.1391 0.1398 0.1189 0.1324 0.1378 0.1409 0.1446
va: 1.2693 2.0699 2.9222 3.6357 2.9298 3.9021 3.9371 3.7579 3.8018 3.8145 3.8297 3.5730 4.0072 3.8624 4.0130 3.8818 4.0234 3.9885 3.9959 4.0665 4.0166 3.9698 3.9606 1.0422 0.9994 1.0041 1.0021 1.0079 1.0168 1.0050 1.0091 0.9977 0.9975 0.9974 1.0334 1.0115 1.0059 1.0199 1.0106 0.9986 0.9971 1.0099
dispcorr: -0.021889204 hartree
energy: -1396.898794506774
dipole: 33.47119 -28.06520 5.40599 0.71521 -3.08625 -2.37104 4.28076 -3.32377 0.95698
magnitude: 5.98016 au
magnitude: 15.20037 debye
temp: 298.15 k
press: 1.00 atm
zeropoint: 0.35151224 hartree
thermalvibcorrection: 0.01552685 hartree
thermalrotcorrection: 0.00141627 hartree
thermaltrasncorrection: 0.00141627 hartree
thermaltotal: -1396.52892287 hartree
thermalcorr: 0.01835939 hartree
nonthermalcorr: 0.35151224 hartree
totalcorr: 0.36987163 hartree
thermalcorrenthalpy: 0.00094421 hartree
totalenthalpy: -1396.52797866 hartree
totalentropycorr: -0.06375324 hartree
gibbsenthalpy: -1396.59173191 hartree
gibbsminuselec: 0.30706260 hartree
