program: Orca
programVersion: 5.0.2
elementType: Cl O N N N C C C C C C C C C C C C C C C C C C H H H H H H H H H H H H H H H H H H H
charge: 1
multiplicity: 1
keywords: wB97X-D3 TightOpt Freq def2-TZVPP def2/J RIJCOSX TightSCF defgrid3 CHELPG
frequency: 0.00 0.00 0.00 0.00 0.00 0.00 17.62 44.77 47.93 76.00 97.63 119.30 128.28 168.16 193.71 213.18 236.49 243.43 269.38 304.17 316.81 343.47 363.19 365.76 391.26 405.99 413.19 428.83 454.15 483.31 490.92 507.85 532.69 552.37 577.28 592.93 623.05 634.26 667.79 706.37 717.81 761.44 781.64 789.56 797.39 810.45 825.47 835.06 861.74 886.85 894.04 913.82 923.02 931.02 940.93 1003.41 1014.90 1023.30 1032.17 1044.31 1046.26 1069.30 1075.91 1095.40 1119.22 1132.50 1139.42 1145.63 1162.10 1183.84 1185.92 1201.47 1216.18 1221.77 1249.94 1262.94 1270.03 1284.06 1299.68 1309.36 1316.89 1326.44 1338.26 1347.05 1356.97 1372.33 1396.42 1416.55 1432.96 1455.96 1459.75 1462.93 1479.88 1490.86 1497.09 1498.29 1506.52 1512.26 1512.68 1518.15 1530.43 1543.08 1645.53 1661.43 1679.40 1687.67 1769.74 2972.38 2993.32 3019.52 3106.29 3108.94 3115.84 3117.46 3124.22 3161.23 3169.67 3178.15 3215.88 3223.31 3228.88 3231.97 3239.22 3241.13 3251.20 3469.18
frequency: 17.62 44.77 47.93 76.00 97.63 119.30 128.28 168.16 193.71 213.18 236.49 243.43 269.38 304.17 316.81 343.47 363.19 365.76 391.26 405.99 413.19 428.83 454.15 483.31 490.92 507.85 532.69 552.37 577.28 592.93 623.05 634.26 667.79 706.37 717.81 761.44 781.64 789.56 797.39 810.45 825.47 835.06 861.74 886.85 894.04 913.82 923.02 931.02 940.93 1003.41 1014.90 1023.30 1032.17 1044.31 1046.26 1069.30 1075.91 1095.40 1119.22 1132.50 1139.42 1145.63 1162.10 1183.84 1185.92 1201.47 1216.18 1221.77 1249.94 1262.94 1270.03 1284.06 1299.68 1309.36 1316.89 1326.44 1338.26 1347.05 1356.97 1372.33 1396.42 1416.55 1432.96 1455.96 1459.75 1462.93 1479.88 1490.86 1497.09 1498.29 1506.52 1512.26 1512.68 1518.15 1530.43 1543.08 1645.53 1661.43 1679.40 1687.67 1769.74 2972.38 2993.32 3019.52 3106.29 3108.94 3115.84 3117.46 3124.22 3161.23 3169.67 3178.15 3215.88 3223.31 3228.88 3231.97 3239.22 3241.13 3251.20 3469.18
formula: C18H19ClN3O
InChI: InChI=1S/C18H19ClN3O/c1-21-8-10-22(11-9-21)18-14-12-13(19)6-7-16(14)23-17-5-3-2-4-15(17)20-18/h2-7,12,22H,8-11H2,1H3
42 atoms
Cl -2.228855 3.594582 -0.835458
O  1.751732 0.019511 1.532219
N  -0.772437 -1.968005 -0.782491
N  -3.397247 -1.940816 0.447537
N  1.43056 -1.479573 -0.815452
C  -1.098859 -2.677753 0.519018
C  -2.029237 -1.646168 -1.55365
C  -2.211078 -1.989081 1.274659
C  -3.15903 -1.09437 -0.700387
C  0.315931 -0.949789 -0.581826
C  -4.573384 -1.520037 1.190031
C  0.024943 0.401105 -0.071775
C  0.787303 0.844158 1.008409
C  2.65266 -0.860544 -0.516878
C  -0.887066 1.277571 -0.656628
C  2.824717 -0.134955 0.662386
C  0.57487 2.094435 1.562163
C  -1.085453 2.530327 -0.109607
C  -0.375084 2.935058 1.013824
C  3.745468 -1.074271 -1.349562
C  4.059345 0.37628 1.006491
C  4.976612 -0.535644 -1.024786
C  5.13504 0.179902 0.154734
H  -0.17265 -2.736026 1.086112
H  -1.418212 -3.680138 0.236306
H  -2.343728 -2.600367 -1.975109
H  -1.757515 -0.983324 -2.372353
H  -2.412184 -2.587217 2.163854
H  -1.893594 -0.991357 1.620677
H  -2.968356 -0.054936 -0.401956
H  -4.047081 -1.086087 -1.334199
H  -4.744817 -2.204127 2.019708
H  -5.446373 -1.553458 0.539712
H  -4.476872 -0.500592 1.591168
H  -1.428467 1.012354 -1.551653
H  1.166051 2.399067 2.414726
H  -0.551499 3.914369 1.437033
H  3.611738 -1.664842 -2.246104
H  4.165078 0.916015 1.937778
H  5.821032 -0.69153 -1.682019
H  6.104503 0.580494 0.418921
H  -0.254024 -2.651044 -1.335909
totalener: -1396.84450617 hartree
nucrepener: 2087.20054062 hartree
electener: -3484.04504679 hartree
oneelecener: -6032.21509424 hartree
twoeener: 2548.17004744 hartree
kineticenergy: 1391.24005182 hartree
xcener: -113.133728634320 hartree
chargesum: 1.0000000
charge: -0.016613 -0.326141 0.236345 -0.166359 -0.271814 -0.124941 -0.157403 -0.121359 -0.152591 0.170957 -0.181667 -0.090913 0.206744 0.147566 -0.166534 0.166906 -0.155758 0.059998 -0.078327 -0.179773 -0.143484 -0.093717 -0.086697 0.146851 0.143299 0.148574 0.141164 0.117910 0.116302 0.127601 0.121081 0.101953 0.102365 0.092644 0.139907 0.146878 0.146329 0.132296 0.140436 0.146337 0.148602 0.165046
charge: 0.448875 0.314758 0.455111 0.173367 0.236626 0.028730 0.019578 -0.078055 -0.079545 -0.158828 -0.028516 -0.092671 -0.173846 -0.162361 -0.018813 -0.170508 0.028017 -0.397030 0.008614 0.020142 0.011483 0.005832 0.019361 0.037787 0.038255 0.040350 0.031029 0.041966 0.021475 0.016464 0.041617 0.019329 0.019586 0.006625 0.025436 0.040472 0.038219 0.031751 0.034037 0.031240 0.032664 0.041376
qa: -0.0166 -0.3261 0.2363 -0.1664 -0.2718 -0.1249 -0.1574 -0.1214 -0.1526 0.1710 -0.1817 -0.0909 0.2067 0.1476 -0.1665 0.1669 -0.1558 0.0600 -0.0783 -0.1798 -0.1435 -0.0937 -0.0867 0.1469 0.1433 0.1486 0.1412 0.1179 0.1163 0.1276 0.1211 0.1020 0.1024 0.0926 0.1399 0.1469 0.1463 0.1323 0.1404 0.1463 0.1486 0.1650
va: 1.2906 2.0719 3.5411 2.8751 3.0188 3.8438 3.8589 3.9090 3.9222 3.9684 3.9509 3.6523 3.9596 3.8557 3.9035 3.9101 4.0401 4.0560 3.9648 4.0563 4.0242 3.9706 3.9587 1.0146 1.0091 1.0061 1.0012 1.0083 1.0059 1.0007 1.0077 0.9990 0.9985 0.9974 1.0180 1.0083 1.0021 1.0149 1.0083 0.9972 0.9950 1.0201
dispcorr: -0.023131937 hartree
energy: -1396.870839630203
dipole: -9.92736 9.12366 -0.80370 -19.82500 18.08344 -1.74156 3.37958 -3.77179 -0.39221
magnitude: 1.95775 au
magnitude: 4.97621 debye
temp: 298.15 k
press: 1.00 atm
zeropoint: 0.35050539 hartree
thermalvibcorrection: 0.01567207 hartree
thermalrotcorrection: 0.00141627 hartree
thermaltrasncorrection: 0.00141627 hartree
thermaltotal: -1396.50182963 hartree
thermalcorr: 0.01850462 hartree
nonthermalcorr: 0.35050539 hartree
totalcorr: 0.36901000 hartree
thermalcorrenthalpy: 0.00094421 hartree
totalenthalpy: -1396.50088542 hartree
totalentropycorr: -0.06409384 hartree
gibbsenthalpy: -1396.56497926 hartree
gibbsminuselec: 0.30586037 hartree
