program: Orca
programVersion: 5.0.2
elementType: C C C C C C C H H C H C H C C H C H C H H C C C C H H C H H H H H H N C H H H S O H
charge: 1
multiplicity: 1
keywords: wB97X-D3 TightOpt Freq def2-TZVPP def2/J RIJCOSX TightSCF defgrid3 CHELPG
frequency: 0.00 0.00 0.00 0.00 0.00 0.00 29.44 50.31 62.77 74.37 85.55 101.72 151.00 162.75 195.46 199.21 221.77 229.99 257.06 282.33 313.05 324.15 343.26 368.93 402.53 425.53 447.58 461.62 475.81 480.10 491.33 502.22 545.80 562.99 616.49 629.69 671.18 695.10 699.92 732.71 754.40 768.23 785.41 788.99 808.40 814.39 841.25 867.65 895.74 903.76 924.51 945.45 947.73 957.38 982.89 993.92 1005.90 1019.30 1029.75 1043.99 1058.32 1060.60 1065.54 1085.34 1113.89 1128.50 1134.64 1152.13 1169.01 1182.44 1191.31 1197.42 1217.27 1241.45 1247.21 1289.70 1295.07 1300.42 1313.89 1319.63 1340.66 1346.04 1352.46 1381.14 1395.02 1399.59 1400.35 1437.20 1444.40 1450.88 1462.52 1469.25 1476.51 1482.80 1490.85 1492.28 1506.18 1508.61 1511.43 1518.86 1542.48 1590.50 1659.73 1687.13 1750.33 1800.82 3036.53 3039.92 3045.46 3093.64 3094.87 3098.20 3151.45 3151.59 3156.80 3157.17 3158.87 3194.89 3196.28 3197.16 3203.53 3216.71 3230.11 3230.87 3269.34 3480.63
frequency: 29.44 50.31 62.77 74.37 85.55 101.72 151.00 162.75 195.46 199.21 221.77 229.99 257.06 282.33 313.05 324.15 343.26 368.93 402.53 425.53 447.58 461.62 475.81 480.10 491.33 502.22 545.80 562.99 616.49 629.69 671.18 695.10 699.92 732.71 754.40 768.23 785.41 788.99 808.40 814.39 841.25 867.65 895.74 903.76 924.51 945.45 947.73 957.38 982.89 993.92 1005.90 1019.30 1029.75 1043.99 1058.32 1060.60 1065.54 1085.34 1113.89 1128.50 1134.64 1152.13 1169.01 1182.44 1191.31 1197.42 1217.27 1241.45 1247.21 1289.70 1295.07 1300.42 1313.89 1319.63 1340.66 1346.04 1352.46 1381.14 1395.02 1399.59 1400.35 1437.20 1444.40 1450.88 1462.52 1469.25 1476.51 1482.80 1490.85 1492.28 1506.18 1508.61 1511.43 1518.86 1542.48 1590.50 1659.73 1687.13 1750.33 1800.82 3036.53 3039.92 3045.46 3093.64 3094.87 3098.20 3151.45 3151.59 3156.80 3157.17 3158.87 3194.89 3196.28 3197.16 3203.53 3216.71 3230.11 3230.87 3269.34 3480.63
formula: C19H20NOS
InChI: InChI=1S/C19H20NOS/c1-20-9-6-13(7-10-20)18-15-5-3-2-4-14(15)12-17(21)19-16(18)8-11-22-19/h2-5,8,11,20H,6-7,9-10,12H2,1H3
42 atoms
C  -0.08279 0.092979 -0.647209
C  0.87734 -1.03596 -0.654042
C  1.84421 -1.229926 0.309573
C  0.545071 1.438475 -0.508808
C  2.115391 -0.455849 1.536384
C  1.199928 1.754809 0.684056
C  1.244474 0.760231 1.816733
H  0.234531 0.39189 2.029398
H  1.629745 1.216633 2.725485
C  0.967933 -2.003397 -1.688024
H  0.337156 -2.010144 -2.565784
C  1.978164 -2.895664 -1.474745
H  2.267379 -3.7169 -2.111606
C  1.813524 2.994152 0.805791
C  0.530177 2.350063 -1.556984
H  0.046138 2.083469 -2.489126
C  1.789653 3.905782 -0.239326
H  2.279976 4.863954 -0.128731
C  1.149729 3.583512 -1.424358
H  1.140086 4.284455 -2.248541
H  2.321507 3.246084 1.728613
C  -1.406824 -0.076557 -0.742183
C  -2.08315 -1.421219 -0.800572
C  -2.391732 1.062952 -0.719472
C  -3.106745 -1.567743 0.315014
H  -1.370967 -2.237305 -0.698787
H  -2.581591 -1.558483 -1.767539
C  -3.412664 0.888742 0.393545
H  -1.895421 2.019181 -0.567864
H  -2.915283 1.131533 -1.680538
H  -3.670239 -2.496216 0.232931
H  -2.631684 -1.531996 1.296119
H  -2.938456 0.910388 1.375495
H  -4.186964 1.65413 0.361961
N  -4.101278 -0.442453 0.290664
C  -5.149371 -0.607268 1.331132
H  -5.865999 0.206015 1.24884
H  -5.649599 -1.561604 1.187058
H  -4.673383 -0.583373 2.308496
S  2.826365 -2.584686 -0.043241
O  2.989826 -0.787343 2.29847
H  -4.559441 -0.469952 -0.6202
totalener: -1264.06937652 hartree
nucrepener: 1924.90378480 hartree
electener: -3188.97316132 hartree
oneelecener: -5528.82722917 hartree
twoeener: 2339.85406785 hartree
kineticenergy: 1258.68914381 hartree
xcener: -105.439844754115 hartree
chargesum: 1.0000000
charge: 0.159282 0.132397 -0.155270 0.002812 0.197861 -0.134471 -0.085167 0.082476 0.107948 -0.332855 0.154490 -0.074507 0.144687 -0.036809 -0.229345 0.136766 -0.128121 0.143700 -0.107499 0.141624 0.127489 0.006693 -0.227506 -0.211717 -0.164096 0.125552 0.130279 -0.164542 0.123177 0.129708 0.140882 0.148428 0.147584 0.141434 0.159329 -0.154580 0.134957 0.135132 0.133321 0.168565 -0.295559 0.145469
charge: -0.026996 -0.101876 -0.319647 -0.058904 -0.295189 -0.057853 0.008853 0.031926 0.044078 -0.066229 0.020208 -0.249455 0.002318 0.015069 0.001598 0.027217 0.005448 0.028735 -0.003210 0.026960 0.030610 -0.070525 -0.003096 -0.001266 0.019883 0.047382 0.035630 0.019555 0.048917 0.036145 0.034442 0.040001 0.039243 0.034431 0.443550 0.071954 0.029371 0.029345 0.033143 0.849052 0.155132 0.044048
qa: 0.1593 0.1324 -0.1553 0.0028 0.1979 -0.1345 -0.0852 0.0825 0.1079 -0.3329 0.1545 -0.0745 0.1447 -0.0368 -0.2293 0.1368 -0.1281 0.1437 -0.1075 0.1416 0.1275 0.0067 -0.2275 -0.2117 -0.1641 0.1256 0.1303 -0.1645 0.1232 0.1297 0.1409 0.1484 0.1476 0.1414 0.1593 -0.1546 0.1350 0.1351 0.1333 0.1686 -0.2956 0.1455
va: 3.3285 3.1420 3.7638 3.3110 4.0684 3.8434 3.7817 1.0154 1.0323 4.0557 1.0036 3.9949 1.0017 3.9207 3.9829 1.0050 3.9963 0.9984 3.9677 0.9990 1.0072 3.3494 3.8789 3.8800 3.8445 1.0254 1.0031 3.8381 1.0288 1.0041 1.0070 1.0011 0.9997 1.0077 3.6283 3.8380 0.9977 0.9977 0.9972 2.8981 2.1888 1.0087
dispcorr: -0.022159503 hartree
energy: -1264.095115972201
dipole: -32.48066 25.44739 -7.03327 5.85734 -6.13698 -0.27964 -0.31604 -0.15366 -0.46970
magnitude: 7.05448 au
magnitude: 17.93107 debye
temp: 298.15 k
press: 1.00 atm
zeropoint: 0.35639339 hartree
thermalvibcorrection: 0.01546987 hartree
thermalrotcorrection: 0.00141627 hartree
thermaltrasncorrection: 0.00141627 hartree
thermaltotal: -1263.72042017 hartree
thermalcorr: 0.01830241 hartree
nonthermalcorr: 0.35639339 hartree
totalcorr: 0.37469580 hartree
thermalcorrenthalpy: 0.00094421 hartree
totalenthalpy: -1263.71947596 hartree
totalentropycorr: -0.06341782 hartree
gibbsenthalpy: -1263.78289378 hartree
gibbsminuselec: 0.31222219 hartree
