program: Orca
programVersion: 5.0.2
elementType: C C C C C C H N H H I I I C H H C H C H H C H H H C O O H H
elementType: I
charge: 1
multiplicity: 1
keywords: wB97X-D3 TightOpt Freq def2-TZVPP def2/J RIJCOSX TightSCF defgrid3 CHELPG
frequency: 0.00 0.00 0.00 0.00 0.00 0.00 21.23 23.55 62.56 68.68 77.05 89.06 94.61 108.58 111.52 137.91 167.16 174.97 204.78 221.89 265.53 272.43 285.06 301.87 314.51 332.40 345.14 387.82 416.10 432.61 501.95 525.68 562.90 615.30 637.73 664.32 670.69 708.67 755.13 760.62 788.57 800.20 812.36 837.63 929.68 948.70 970.61 1010.84 1034.90 1068.01 1075.15 1103.94 1109.55 1154.76 1203.38 1224.04 1241.15 1257.59 1276.50 1305.32 1338.07 1343.51 1356.34 1371.34 1399.13 1433.92 1436.42 1495.16 1495.91 1497.78 1504.97 1512.83 1581.14 1586.22 1622.23 1641.85 1671.09 3060.15 3073.91 3101.41 3108.57 3114.33 3153.19 3156.03 3161.86 3229.23 3291.48 3627.54 3745.24 3756.21
frequency: 21.23 23.55 62.56 68.68 77.05 89.06 94.61 108.58 111.52 137.91 167.16 174.97 204.78 221.89 265.53 272.43 285.06 301.87 314.51 332.40 345.14 387.82 416.10 432.61 501.95 525.68 562.90 615.30 637.73 664.32 670.69 708.67 755.13 760.62 788.57 800.20 812.36 837.63 929.68 948.70 970.61 1010.84 1034.90 1068.01 1075.15 1103.94 1109.55 1154.76 1203.38 1224.04 1241.15 1257.59 1276.50 1305.32 1338.07 1343.51 1356.34 1371.34 1399.13 1433.92 1436.42 1495.16 1495.91 1497.78 1504.97 1512.83 1581.14 1586.22 1622.23 1641.85 1671.09 3060.15 3073.91 3101.41 3108.57 3114.33 3153.19 3156.03 3161.86 3229.23 3291.48 3627.54 3745.24 3756.21
formula: C11H13I3NO2
InChI: InChI=1S/C11H13I3NO2/c1-2-5(11(16)17)3-6-7(12)4-8(13)10(15)9(6)14/h4-5,16-17H,2-3,15H2,1H3
30 atoms
C  -2.117629 -0.199817 -0.018597
C  -1.336364 -1.329633 -0.093769
C  0.033629 -1.243242 -0.301471
C  0.655868 -0.001204 -0.429913
C  -0.163135 1.136106 -0.369681
C  -1.555522 1.084242 -0.167292
H  -1.801767 -2.300628 0.001845
N  -2.329638 2.19632 -0.074897
H  -1.981781 3.085828 -0.378309
H  -3.328093 2.083757 -0.081805
I  -4.165034 -0.433886 0.298496
I  0.680503 3.061887 -0.596278
I  1.055955 -3.062916 -0.493327
C  2.149982 0.091585 -0.632795
H  2.432012 1.065509 -1.026126
H  2.439479 -0.631099 -1.395233
C  3.009531 -0.238835 0.600786
H  2.978014 -1.313152 0.789299
C  4.499116 0.166569 0.411681
H  4.558399 1.246259 0.248757
H  5.043047 -0.051408 1.332894
C  5.147674 -0.579596 -0.746507
H  5.051649 -1.658985 -0.623463
H  4.714961 -0.304033 -1.707178
H  6.209171 -0.340903 -0.78647
C  2.570718 0.381281 1.873491
O  2.110605 1.556481 2.034112
O  2.74318 -0.305223 2.941595
H  2.492133 0.182735 3.741053
H  1.908928 2.059634 1.205667
totalener: -1525.37259918 hartree
nucrepener: 1975.24773993 hartree
electener: -3500.62033911 hartree
oneelecener: -6323.23885904 hartree
twoeener: 2822.61851993 hartree
kineticenergy: 969.37973211 hartree
xcener: -107.322751447820 hartree
chargesum: 1.0000000
charge: -0.118120 -0.033350 -0.193416 0.061285 -0.102253 0.104641 0.130833 -0.259445 0.159893 0.169141 0.107246 0.064553 0.111414 -0.416196 0.164292 0.154129 0.046729 0.115616 -0.135493 0.095937 0.114444 -0.253548 0.097940 0.095573 0.114782 0.448407 -0.185848 -0.143085 0.248541 0.235355
charge: -0.333431 -0.074610 -0.340588 -0.152589 -0.310018 -0.218053 0.032510 0.352167 -0.057823 -0.049154 0.452041 0.507020 0.438548 -0.015334 0.013483 0.041350 -0.074541 0.042413 -0.001852 0.027539 0.031892 0.027137 0.022463 0.016740 0.026926 -0.236476 0.488232 0.504900 -0.035185 -0.125708
qa: -0.1181 -0.0333 -0.1934 0.0613 -0.1023 0.1046 0.1308 -0.2594 0.1599 0.1691 0.1072 0.0646 0.1114 -0.4162 0.1643 0.1541 0.0467 0.1156 -0.1355 0.0959 0.1144 -0.2535 0.0979 0.0956 0.1148 0.4484 -0.1858 -0.1431 0.2485 0.2354
va: 4.1387 3.8478 4.2225 3.1423 3.9868 3.8857 0.9971 3.2834 1.0384 1.0484 1.2748 1.4121 1.3118 3.8849 0.9944 0.9984 3.6512 1.0624 3.8847 1.0044 1.0088 3.9515 1.0020 1.0020 1.0054 4.0474 2.3530 2.4247 1.0061 1.1132
dispcorr: -0.018429171 hartree
energy: -1525.393716845351
dipole: 177.29460 -173.88799 3.40661 30.90161 -29.40599 1.49562 51.88676 -50.07876 1.80800
magnitude: 4.13652 au
magnitude: 10.51419 debye
temp: 298.15 k
press: 1.00 atm
zeropoint: 0.22859120 hartree
thermalvibcorrection: 0.01614316 hartree
thermalrotcorrection: 0.00141627 hartree
thermaltrasncorrection: 0.00141627 hartree
thermaltotal: -1525.14614994 hartree
thermalcorr: 0.01897570 hartree
nonthermalcorr: 0.22859120 hartree
totalcorr: 0.24756690 hartree
thermalcorrenthalpy: 0.00094421 hartree
totalenthalpy: -1525.14520573 hartree
totalentropycorr: -0.06811846 hartree
gibbsenthalpy: -1525.21332420 hartree
gibbsminuselec: 0.18039265 hartree
