program: Orca
programVersion: 5.0.2
elementType: C C C C C C C C H H H O C H H H C H H C O O C H H H C O C C C C H C H C H H Cl N H H
charge: 1
multiplicity: 1
keywords: wB97X-D3 TightOpt Freq def2-TZVPP def2/J RIJCOSX TightSCF defgrid3 CHELPG
frequency: 0.00 0.00 0.00 0.00 0.00 0.00 21.15 29.12 33.22 42.96 47.00 68.81 80.31 84.29 116.64 139.25 153.85 181.66 196.54 205.93 221.31 231.97 260.59 270.82 285.42 319.18 326.86 350.83 370.39 382.61 421.66 429.58 435.48 441.12 465.79 474.19 506.88 533.14 561.06 583.22 589.25 606.39 621.24 630.59 644.67 655.86 677.95 717.57 729.70 755.96 767.41 777.63 797.34 844.86 857.73 874.01 881.56 887.53 909.29 912.15 941.98 981.97 1009.75 1012.68 1028.43 1041.90 1045.67 1067.21 1082.44 1114.79 1143.62 1151.59 1164.37 1179.97 1181.48 1188.60 1210.05 1218.04 1222.09 1238.50 1255.35 1284.05 1296.17 1303.00 1321.36 1336.88 1342.51 1362.62 1382.31 1406.58 1442.78 1454.20 1470.70 1475.39 1485.24 1488.17 1493.65 1505.14 1507.02 1523.48 1548.23 1551.42 1635.36 1671.47 1673.21 1695.84 1700.46 1744.18 1886.41 3048.79 3081.21 3088.14 3123.78 3126.00 3157.78 3181.99 3190.06 3201.64 3212.51 3227.50 3239.07 3239.94 3247.92 3283.58 3828.45 3887.41
frequency: 21.15 29.12 33.22 42.96 47.00 68.81 80.31 84.29 116.64 139.25 153.85 181.66 196.54 205.93 221.31 231.97 260.59 270.82 285.42 319.18 326.86 350.83 370.39 382.61 421.66 429.58 435.48 441.12 465.79 474.19 506.88 533.14 561.06 583.22 589.25 606.39 621.24 630.59 644.67 655.86 677.95 717.57 729.70 755.96 767.41 777.63 797.34 844.86 857.73 874.01 881.56 887.53 909.29 912.15 941.98 981.97 1009.75 1012.68 1028.43 1041.90 1045.67 1067.21 1082.44 1114.79 1143.62 1151.59 1164.37 1179.97 1181.48 1188.60 1210.05 1218.04 1222.09 1238.50 1255.35 1284.05 1296.17 1303.00 1321.36 1336.88 1342.51 1362.62 1382.31 1406.58 1442.78 1454.20 1470.70 1475.39 1485.24 1488.17 1493.65 1505.14 1507.02 1523.48 1548.23 1551.42 1635.36 1671.47 1673.21 1695.84 1700.46 1744.18 1886.41 3048.79 3081.21 3088.14 3123.78 3126.00 3157.78 3181.99 3190.06 3201.64 3212.51 3227.50 3239.07 3239.94 3247.92 3283.58 3828.45 3887.41
formula: C19H17ClNO4
InChI: InChI=1S/C19H17ClNO4/c1-11-15(10-18(22)23)16-9-14(25-2)7-8-17(16)21(11)19(24)12-3-5-13(20)6-4-12/h3-9,22,24H,10H2,1-2H3
42 atoms
C  -1.421814 -0.972909 0.120407
C  -2.212837 0.075971 -0.347505
C  -3.553856 -0.107508 -0.586146
C  -4.1105 -1.36971 -0.353271
C  -3.307146 -2.414292 0.107185
C  -1.951437 -2.225789 0.348476
C  -0.1115 0.943015 -0.13121
C  -1.367966 1.255102 -0.477275
H  -4.195682 0.686212 -0.943892
H  -3.731294 -3.388893 0.295753
H  -1.366333 -3.050194 0.719242
O  -5.420988 -1.476598 -0.599824
C  -6.06476 -2.720813 -0.378607
H  -7.106909 -2.566598 -0.639961
H  -5.64268 -3.500262 -1.016642
H  -5.994365 -3.017754 0.669918
C  -1.881502 2.617104 -0.79718
H  -1.149394 3.193318 -1.367327
H  -2.772197 2.545057 -1.423925
C  -2.195236 3.410964 0.474285
O  -2.950356 4.502085 0.303616
O  -1.773722 3.116404 1.550412
C  1.02598 1.875629 0.104831
H  0.6291 2.885231 0.169232
H  1.514379 1.674035 1.057541
H  1.782985 1.851459 -0.676876
C  0.972793 -1.157258 0.571975
O  0.745223 -2.299972 1.171073
C  2.364302 -0.793171 0.301795
C  3.308962 -0.858224 1.327234
C  2.762442 -0.498129 -1.001016
C  4.637245 -0.596101 1.057957
H  3.004123 -1.073661 2.344794
C  4.093866 -0.261006 -1.276748
H  2.033386 -0.474034 -1.801262
C  5.024601 -0.30128 -0.244588
H  5.374276 -0.617058 1.848304
H  4.417393 -0.046483 -2.285583
Cl 6.674038 0.011589 -0.583557
N  -0.079571 -0.466512 0.218929
H  1.56416 -2.798877 1.267239
H  -3.226715 4.613771 -0.608449
totalener: -1549.98372606 hartree
nucrepener: 2229.08054114 hartree
electener: -3779.06426719 hartree
oneelecener: -6526.12094453 hartree
twoeener: 2747.05667734 hartree
kineticenergy: 1543.89678839 hartree
xcener: -125.050050002309 hartree
chargesum: 1.0000000
charge: -0.067934 0.008278 -0.090079 0.273050 -0.159166 -0.114704 -0.020701 0.030341 0.116683 0.121648 0.141063 -0.263535 -0.138953 0.131549 0.109079 0.111617 -0.276454 0.135402 0.108878 0.364377 -0.210972 -0.301256 -0.222792 0.120312 0.116356 0.129303 0.527918 -0.214942 -0.076911 -0.166702 -0.236131 -0.130608 0.170556 -0.088893 0.166631 0.083973 0.150138 0.149684 0.013322 0.064920 0.237398 0.198254
charge: -0.086448 -0.054944 0.033439 -0.197305 -0.004481 0.010951 -0.070186 -0.037710 0.030814 0.024782 0.020863 0.308211 -0.035018 0.018870 0.007899 0.008759 -0.011232 0.046602 0.038389 -0.438467 0.395283 0.149231 0.036189 0.038431 0.035246 0.025301 -0.168713 0.472703 -0.113500 0.018199 0.028486 -0.002380 0.038115 -0.005205 0.040414 -0.374654 0.037940 0.037249 0.484028 0.377207 -0.061849 -0.101509
qa: -0.0679 0.0083 -0.0901 0.2731 -0.1592 -0.1147 -0.0207 0.0303 0.1167 0.1216 0.1411 -0.2635 -0.1390 0.1315 0.1091 0.1116 -0.2765 0.1354 0.1089 0.3644 -0.2110 -0.3013 -0.2228 0.1203 0.1164 0.1293 0.5279 -0.2149 -0.0769 -0.1667 -0.2361 -0.1306 0.1706 -0.0889 0.1666 0.0840 0.1501 0.1497 0.0133 0.0649 0.2374 0.1983
va: 4.0120 4.0245 4.0045 4.0151 3.9344 4.0812 3.7651 3.6612 1.0261 1.0201 1.0277 2.1502 3.8777 0.9976 0.9855 0.9855 3.9221 0.9940 1.0105 4.2453 2.2505 2.1754 3.9662 1.0150 1.0001 0.9901 3.7852 2.3017 3.6322 3.9798 4.0264 4.0202 1.0023 3.9842 0.9979 4.0614 1.0078 1.0064 1.3247 3.4475 1.0133 1.0341
dispcorr: -0.021604364 hartree
energy: -1550.009154975616
dipole: -23.95282 24.51082 0.55800 -2.97832 1.32997 -1.64835 -1.61191 0.60233 -1.00958
magnitude: 2.01188 au
magnitude: 5.11380 debye
temp: 298.15 k
press: 1.00 atm
zeropoint: 0.33089375 hartree
thermalvibcorrection: 0.01963361 hartree
thermalrotcorrection: 0.00141627 hartree
thermaltrasncorrection: 0.00141627 hartree
thermaltotal: -1549.65579508 hartree
thermalcorr: 0.02246615 hartree
nonthermalcorr: 0.33089375 hartree
totalcorr: 0.35335990 hartree
thermalcorrenthalpy: 0.00094421 hartree
totalenthalpy: -1549.65485087 hartree
totalentropycorr: -0.07264005 hartree
gibbsenthalpy: -1549.72749092 hartree
gibbsminuselec: 0.28166406 hartree
