program: Orca
programVersion: 5.0.2
elementType: Cl F O O N C C C C C C C C C C C C C C C C C C C C C H H H H H H H H H H H H H H H H H H H H H H H H
charge: 1
multiplicity: 1
keywords: wB97X-D3 TightOpt Freq def2-TZVPP def2/J RIJCOSX TightSCF defgrid3 CHELPG
frequency: 0.00 0.00 0.00 0.00 0.00 0.00 13.29 18.40 26.44 34.84 52.72 63.26 74.26 105.68 112.94 118.72 139.21 184.20 210.52 230.87 247.27 261.59 273.68 295.46 298.22 318.39 324.28 350.46 376.13 378.70 414.19 423.40 424.10 424.25 446.77 468.06 473.32 491.32 495.57 519.58 528.71 557.58 567.33 587.39 628.19 648.69 652.30 710.16 729.68 747.91 760.40 771.12 809.65 832.11 850.28 852.46 862.69 873.20 876.21 878.88 910.15 933.88 952.32 970.10 996.96 1001.15 1001.92 1008.79 1020.90 1026.33 1026.95 1027.24 1039.99 1045.20 1067.28 1078.97 1097.15 1121.14 1131.45 1140.64 1143.27 1146.33 1158.83 1182.38 1190.61 1198.26 1224.26 1231.28 1257.41 1270.44 1282.20 1287.88 1308.93 1312.74 1315.72 1325.33 1332.98 1340.29 1344.75 1347.97 1368.83 1385.21 1391.05 1400.39 1422.34 1424.06 1434.10 1440.64 1455.96 1462.61 1471.48 1478.27 1482.97 1494.29 1494.71 1507.83 1518.03 1533.07 1552.28 1554.68 1571.38 1652.02 1657.95 1680.58 1686.05 1730.89 3037.60 3061.17 3079.00 3084.94 3085.41 3093.81 3101.39 3109.37 3123.98 3131.23 3133.60 3145.11 3150.20 3159.71 3168.62 3205.92 3219.06 3224.36 3229.85 3232.96 3235.77 3242.33 3243.15 3890.99
frequency: 13.29 18.40 26.44 34.84 52.72 63.26 74.26 105.68 112.94 118.72 139.21 184.20 210.52 230.87 247.27 261.59 273.68 295.46 298.22 318.39 324.28 350.46 376.13 378.70 414.19 423.40 424.10 424.25 446.77 468.06 473.32 491.32 495.57 519.58 528.71 557.58 567.33 587.39 628.19 648.69 652.30 710.16 729.68 747.91 760.40 771.12 809.65 832.11 850.28 852.46 862.69 873.20 876.21 878.88 910.15 933.88 952.32 970.10 996.96 1001.15 1001.92 1008.79 1020.90 1026.33 1026.95 1027.24 1039.99 1045.20 1067.28 1078.97 1097.15 1121.14 1131.45 1140.64 1143.27 1146.33 1158.83 1182.38 1190.61 1198.26 1224.26 1231.28 1257.41 1270.44 1282.20 1287.88 1308.93 1312.74 1315.72 1325.33 1332.98 1340.29 1344.75 1347.97 1368.83 1385.21 1391.05 1400.39 1422.34 1424.06 1434.10 1440.64 1455.96 1462.61 1471.48 1478.27 1482.97 1494.29 1494.71 1507.83 1518.03 1533.07 1552.28 1554.68 1571.38 1652.02 1657.95 1680.58 1686.05 1730.89 3037.60 3061.17 3079.00 3084.94 3085.41 3093.81 3101.39 3109.37 3123.98 3131.23 3133.60 3145.11 3150.20 3159.71 3168.62 3205.92 3219.06 3224.36 3229.85 3232.96 3235.77 3242.33 3243.15 3890.99
formula: C21H24ClFNO2
InChI: InChI=1S/C21H24ClFNO2/c22-18-7-5-17(6-8-18)21(26)11-14-24(15-12-21)13-1-2-20(25)16-3-9-19(23)10-4-16/h3-10,24,26H,1-2,11-15H2
50 atoms
Cl 6.695362 2.94952 -0.09769
F  -6.912419 3.578716 0.345991
O  3.034691 -2.583454 0.330134
O  -2.014458 -0.222174 -0.34186
N  -0.34951 -2.26199 0.13042
C  2.437249 -1.316286 0.066395
C  1.502639 -1.057324 1.253843
C  1.571265 -1.433414 -1.195585
C  0.444549 -2.136661 1.387732
C  0.538466 -2.533272 -1.03941
C  -1.450913 -3.264158 0.248967
C  3.497932 -0.230558 -0.020258
C  -2.614007 -2.990283 -0.70009
C  4.519299 -0.219555 0.928971
C  3.488471 0.764111 -0.990703
C  -3.646423 -1.958576 -0.243708
C  5.503649 0.75095 0.910922
C  4.468038 1.744967 -1.018775
C  -3.202318 -0.509834 -0.236741
C  5.472264 1.734451 -0.066752
C  -4.213716 0.549836 -0.087114
C  -5.568956 0.268342 0.105779
C  -3.793954 1.883259 -0.127216
C  -6.486743 1.288009 0.256956
C  -4.698783 2.912838 0.015824
C  -6.034021 2.594914 0.206452
H  1.033924 -0.07779 1.135196
H  2.083649 -1.029181 2.174888
H  2.193532 -1.665675 -2.06099
H  1.065441 -0.488425 -1.403863
H  -0.255872 -1.900562 2.187711
H  0.895551 -3.108507 1.588069
H  -0.092061 -2.606428 -1.922998
H  1.016238 -3.496314 -0.862282
H  -1.014259 -4.24425 0.059561
H  -1.791816 -3.248906 1.28446
H  -3.139988 -3.937038 -0.826099
H  -2.242868 -2.728798 -1.693198
H  3.844932 -2.66092 -0.176318
H  4.554453 -0.987805 1.691644
H  2.719713 0.795722 -1.750758
H  -4.004805 -2.195569 0.763768
H  -4.522433 -2.0414 -0.888255
H  6.293682 0.748745 1.649136
H  4.454517 2.512616 -1.780025
H  -5.926002 -0.751601 0.146544
H  -2.744843 2.098792 -0.275773
H  -7.538519 1.09124 0.409474
H  -4.395185 3.949845 -0.016932
H  -0.83994 -1.357585 -0.050682
totalener: -1579.85536540 hartree
nucrepener: 2362.10931926 hartree
electener: -3941.96468466 hartree
oneelecener: -6831.91693148 hartree
twoeener: 2889.95224682 hartree
kineticenergy: 1573.43709364 hartree
xcener: -129.321777449528 hartree
chargesum: 1.0000000
charge: -0.037635 -0.166451 -0.352996 -0.411460 0.162813 0.546468 -0.260054 -0.272106 -0.149489 -0.158600 -0.134302 -0.095582 -0.190855 -0.196637 -0.161629 -0.115170 -0.153158 -0.143363 0.372213 0.099930 -0.053954 -0.140217 -0.116488 -0.169847 -0.152514 0.301827 0.115391 0.119729 0.125508 0.099475 0.121660 0.151581 0.134585 0.140094 0.136111 0.117935 0.117468 0.107646 0.189481 0.142957 0.122054 0.109306 0.116106 0.134659 0.129678 0.132632 0.145347 0.143675 0.144716 0.151461
charge: 0.434250 0.234798 0.308786 0.165163 0.445765 -0.241470 0.002473 -0.007119 0.006199 0.007284 0.007318 -0.079835 -0.011180 0.003777 0.001148 -0.013786 -0.019201 -0.021151 -0.207465 -0.390058 -0.103170 0.026930 0.046490 0.009561 0.011315 -0.202672 0.039124 0.043810 0.041410 0.033002 0.030252 0.038134 0.028458 0.033068 0.036092 0.033609 0.041471 0.029259 -0.122753 0.029374 0.023187 0.044205 0.044279 0.030324 0.029036 0.028378 0.032910 0.035617 0.035866 -0.052263
qa: -0.0376 -0.1665 -0.3530 -0.4115 0.1628 0.5465 -0.2601 -0.2721 -0.1495 -0.1586 -0.1343 -0.0956 -0.1909 -0.1966 -0.1616 -0.1152 -0.1532 -0.1434 0.3722 0.0999 -0.0540 -0.1402 -0.1165 -0.1698 -0.1525 0.3018 0.1154 0.1197 0.1255 0.0995 0.1217 0.1516 0.1346 0.1401 0.1361 0.1179 0.1175 0.1076 0.1895 0.1430 0.1221 0.1093 0.1161 0.1347 0.1297 0.1326 0.1453 0.1437 0.1447 0.1515
va: 1.2682 1.1414 2.0853 2.0774 3.4976 3.5342 3.9115 3.9972 3.8512 3.8627 3.8707 3.5768 3.9411 4.0550 3.9942 3.8079 4.0650 4.0762 3.8117 3.9868 3.7348 3.9611 3.9698 3.9817 3.9454 4.0179 1.0194 1.0208 1.0150 1.0226 1.0076 1.0058 1.0076 1.0254 1.0052 1.0005 1.0102 1.0147 1.0459 1.0220 1.0094 1.0075 1.0074 1.0122 1.0145 1.0054 1.0214 1.0052 1.0046 1.1221
dispcorr: -0.025860773 hartree
energy: -1579.884766279282
dipole: -10.93131 8.68627 -2.24503 -34.61047 31.16984 -3.44062 -0.76781 0.65098 -0.11683
magnitude: 4.10995 au
magnitude: 10.44667 debye
temp: 298.15 k
press: 1.00 atm
zeropoint: 0.42204547 hartree
thermalvibcorrection: 0.02031699 hartree
thermalrotcorrection: 0.00141627 hartree
thermaltrasncorrection: 0.00141627 hartree
thermaltotal: -1579.43957127 hartree
thermalcorr: 0.02314954 hartree
nonthermalcorr: 0.42204547 hartree
totalcorr: 0.44519500 hartree
thermalcorrenthalpy: 0.00094421 hartree
totalenthalpy: -1579.43862707 hartree
totalentropycorr: -0.07444959 hartree
gibbsenthalpy: -1579.51307665 hartree
gibbsminuselec: 0.37168963 hartree
