program: Orca
programVersion: 5.0.2
elementType: Cl F O O O O O C C C C C C C C C C C C C C C C C C C C C C C C H H H H H H H H H H H H H H H H H H H H H H H H H H H H H H H H H
charge: 1
multiplicity: 1
keywords: wB97X-D3 TightOpt Freq def2-TZVPP def2/J RIJCOSX TightSCF defgrid3 CHELPG
frequency: 0.00 0.00 0.00 0.00 0.00 0.00 17.12 26.50 39.31 59.91 68.57 70.31 92.83 103.36 122.25 142.38 151.65 156.05 170.96 185.83 191.92 194.29 206.08 219.57 232.25 242.38 248.68 264.29 275.26 290.28 293.53 296.15 306.74 310.54 324.45 330.94 343.22 355.66 370.45 374.61 382.36 405.38 415.12 438.43 442.54 471.75 489.36 499.51 517.03 519.33 534.72 542.84 545.26 564.48 580.83 602.06 619.81 641.67 649.98 677.57 693.05 704.62 706.31 726.82 762.82 792.25 803.27 824.30 834.06 844.27 865.90 887.01 892.48 893.72 899.51 915.31 930.64 939.97 949.65 954.31 955.74 965.85 973.73 982.47 990.62 1007.84 1010.97 1013.76 1023.78 1046.52 1053.94 1071.24 1075.01 1084.67 1100.33 1113.27 1127.58 1132.48 1138.59 1143.74 1154.15 1156.70 1174.74 1192.65 1198.32 1204.38 1205.23 1211.53 1219.01 1226.24 1235.72 1246.81 1252.93 1256.82 1260.71 1268.50 1286.93 1294.94 1305.31 1308.85 1316.96 1320.34 1329.01 1352.30 1360.95 1364.87 1370.96 1373.24 1384.24 1389.90 1394.72 1402.88 1405.88 1411.26 1422.89 1428.26 1430.72 1439.43 1447.55 1450.21 1454.67 1463.39 1474.49 1480.30 1485.41 1493.01 1495.31 1502.28 1503.79 1506.03 1507.64 1509.93 1511.04 1517.94 1528.98 1532.58 1558.78 1602.71 1835.33 3034.53 3041.47 3049.28 3057.24 3070.79 3073.14 3078.98 3080.89 3084.07 3089.37 3091.96 3097.38 3100.17 3119.12 3127.52 3136.47 3136.59 3139.88 3143.51 3147.24 3149.56 3155.46 3156.78 3162.34 3163.76 3167.62 3171.64 3177.62 3188.66 3209.86 3219.04 3799.44 3906.08
frequency: 17.12 26.50 39.31 59.91 68.57 70.31 92.83 103.36 122.25 142.38 151.65 156.05 170.96 185.83 191.92 194.29 206.08 219.57 232.25 242.38 248.68 264.29 275.26 290.28 293.53 296.15 306.74 310.54 324.45 330.94 343.22 355.66 370.45 374.61 382.36 405.38 415.12 438.43 442.54 471.75 489.36 499.51 517.03 519.33 534.72 542.84 545.26 564.48 580.83 602.06 619.81 641.67 649.98 677.57 693.05 704.62 706.31 726.82 762.82 792.25 803.27 824.30 834.06 844.27 865.90 887.01 892.48 893.72 899.51 915.31 930.64 939.97 949.65 954.31 955.74 965.85 973.73 982.47 990.62 1007.84 1010.97 1013.76 1023.78 1046.52 1053.94 1071.24 1075.01 1084.67 1100.33 1113.27 1127.58 1132.48 1138.59 1143.74 1154.15 1156.70 1174.74 1192.65 1198.32 1204.38 1205.23 1211.53 1219.01 1226.24 1235.72 1246.81 1252.93 1256.82 1260.71 1268.50 1286.93 1294.94 1305.31 1308.85 1316.96 1320.34 1329.01 1352.30 1360.95 1364.87 1370.96 1373.24 1384.24 1389.90 1394.72 1402.88 1405.88 1411.26 1422.89 1428.26 1430.72 1439.43 1447.55 1450.21 1454.67 1463.39 1474.49 1480.30 1485.41 1493.01 1495.31 1502.28 1503.79 1506.03 1507.64 1509.93 1511.04 1517.94 1528.98 1532.58 1558.78 1602.71 1835.33 3034.53 3041.47 3049.28 3057.24 3070.79 3073.14 3078.98 3080.89 3084.07 3089.37 3091.96 3097.38 3100.17 3119.12 3127.52 3136.47 3136.59 3139.88 3143.51 3147.24 3149.56 3155.46 3156.78 3162.34 3163.76 3167.62 3171.64 3177.62 3188.66 3209.86 3219.04 3799.44 3906.08
formula: C24H33ClFO5
InChI: InChI=1S/C24H33ClFO5/c1-20(2)30-19-10-16-15-6-5-13-9-14(27)7-8-21(13,3)23(15,26)17(28)11-22(16,4)24(19,31-20)18(29)12-25/h9,15-17,19,27-28H,5-8,10-12H2,1-4H3
64 atoms
Cl 3.686597 3.15357 -0.601101
F  -1.696028 -0.676115 -1.14485
O  2.776804 -0.691634 -1.093337
O  2.86048 -2.556465 0.141433
O  -1.080414 2.504377 0.303687
O  4.323686 0.780116 1.657899
O  -6.960671 -0.363676 -1.304598
C  1.276827 0.411586 0.495259
C  0.457522 -0.861991 0.764218
C  -1.000036 -0.585349 1.104598
C  2.68579 -0.218071 0.231196
C  -1.653548 0.20358 -0.039616
C  1.321523 -1.654837 1.735428
C  2.703949 -1.52343 1.096588
C  0.658745 1.098441 -0.719582
C  -0.830405 1.405755 -0.554368
C  -3.16113 0.538146 0.228843
C  -1.754815 -1.893065 1.329217
C  1.348712 1.336708 1.717843
C  -3.863343 -0.77485 0.475572
C  -3.265412 -1.705267 1.46737
C  3.864721 0.713581 0.549415
C  3.336497 -2.005367 -1.064493
C  -3.742819 1.253272 -1.000907
C  -3.413563 1.379873 1.506758
C  -5.262921 1.233303 -1.042965
C  -5.073023 -1.082856 -0.088096
C  4.459301 1.545584 -0.579943
C  4.858231 -1.950426 -1.07487
C  2.771253 -2.787862 -2.225261
C  -5.780683 -0.131443 -0.823608
H  0.455286 -1.426164 -0.174317
H  -1.051371 0.02655 2.007672
H  1.311266 -1.225092 2.738077
H  1.05539 -2.707829 1.812797
H  3.519181 -1.52956 1.819494
H  0.77766 0.450094 -1.587446
H  1.168963 2.034397 -0.962639
H  -1.222173 1.632886 -1.551767
H  -1.383481 -2.385862 2.226556
H  -1.555919 -2.565181 0.493454
H  0.358875 1.602315 2.079508
H  1.905413 0.891166 2.53978
H  1.860578 2.265497 1.463871
H  -3.483693 -1.251839 2.443285
H  -3.786597 -2.661837 1.454601
H  -3.368967 0.771378 -1.904425
H  -3.396275 2.285046 -1.009828
H  -4.477242 1.39183 1.751125
H  -2.886315 0.986666 2.371714
H  -3.075871 2.39726 1.345429
H  -0.382315 3.149815 0.190806
H  -5.655925 1.619003 -1.983333
H  -5.702024 1.854697 -0.252698
H  -5.531894 -2.045064 0.111429
H  4.298873 1.095409 -1.552744
H  5.515494 1.699234 -0.381076
H  5.261133 -2.961478 -1.044167
H  5.21697 -1.459149 -1.978839
H  5.244247 -1.417297 -0.204827
H  3.120325 -3.818062 -2.182259
H  1.683658 -2.778634 -2.177275
H  3.091743 -2.348028 -3.168434
H  -7.278641 -1.25486 -1.112156
totalener: -1870.52721449 hartree
nucrepener: 3777.84487722 hartree
electener: -5648.37209171 hartree
twoeener: 4405.26117114 hartree
kineticenergy: 1862.70646749 hartree
xcener: -155.966482435459 hartree
chargesum: 1.0000000
charge: -0.113532 -0.248590 -0.405888 -0.360163 -0.336516 -0.269150 -0.158643 0.650021 -0.372628 -0.107901 0.151003 0.415897 -0.258090 0.200148 -0.428106 0.020332 0.412845 -0.235121 -0.415815 -0.164612 -0.150146 0.117572 0.357017 -0.298383 -0.363729 -0.140056 -0.073362 -0.110771 -0.315895 -0.265889 0.318187 0.123844 0.115106 0.098883 0.095639 0.111667 0.128666 0.090820 0.123822 0.100958 0.120913 0.098544 0.121941 0.111985 0.133101 0.097337 0.133374 0.112264 0.115749 0.112665 0.143049 0.179844 0.133216 0.132773 0.098425 0.136384 0.151617 0.113391 0.098473 0.098679 0.103579 0.086743 0.094830 0.231683
charge: 0.348792 0.142698 0.265364 0.259855 0.310976 0.184994 0.491699 -0.118393 -0.055646 -0.052504 -0.212960 -0.181675 0.010591 -0.118616 -0.000405 -0.157271 -0.113603 0.013839 0.032706 0.096492 0.020236 -0.291866 -0.382623 0.016788 0.059665 0.020867 -0.008391 -0.257073 0.025076 0.024195 -0.083956 0.046745 0.037700 0.026317 0.026346 0.021755 0.037211 0.018078 0.025867 0.034912 0.036399 0.005952 0.022014 0.015444 0.059068 0.039974 0.036838 0.041304 0.019422 0.017704 0.023513 -0.127207 0.053019 0.059059 0.033480 0.003286 0.016867 0.027828 0.020552 0.020132 0.026047 0.016112 0.023083 -0.054672
qa: -0.1135 -0.2486 -0.4059 -0.3602 -0.3365 -0.2692 -0.1586 0.6500 -0.3726 -0.1079 0.1510 0.4159 -0.2581 0.2001 -0.4281 0.0203 0.4128 -0.2351 -0.4158 -0.1646 -0.1501 0.1176 0.3570 -0.2984 -0.3637 -0.1401 -0.0734 -0.1108 -0.3159 -0.2659 0.3182 0.1238 0.1151 0.0989 0.0956 0.1117 0.1287 0.0908 0.1238 0.1010 0.1209 0.0985 0.1219 0.1120 0.1331 0.0973 0.1334 0.1123 0.1157 0.1127 0.1430 0.1798 0.1332 0.1328 0.0984 0.1364 0.1516 0.1134 0.0985 0.0987 0.1036 0.0867 0.0948 0.2317
va: 1.1750 1.0675 1.9940 2.0772 2.0856 2.1744 2.4097 3.2350 4.1657 3.9001 3.9137 3.7663 3.9686 3.9614 3.9633 4.0215 3.5232 3.9565 3.9415 3.9217 3.9777 4.0297 3.9988 3.8878 3.9405 3.9632 3.8377 3.9317 3.9707 3.9541 3.8538 1.0388 0.9898 1.0102 1.0386 1.0182 1.0384 1.0676 0.9958 1.0188 1.0028 1.0120 1.0145 1.0267 0.9937 1.0226 1.0131 1.0240 0.9929 1.0058 1.0208 1.0515 1.0207 1.0071 1.0255 1.0247 1.0057 1.0142 1.0071 1.0025 1.0083 1.0109 1.0079 1.0129
dispcorr: -0.046775502 hartree
energy: -1870.577689563009
dipole: -11.97581 5.17136 -6.80445 -11.65486 10.72324 -0.93161 5.40117 -5.90504 -0.50387
magnitude: 6.88639 au
magnitude: 17.50381 debye
temp: 298.15 k
press: 1.00 atm
zeropoint: 0.54994722 hartree
thermalvibcorrection: 0.02607315 hartree
thermalrotcorrection: 0.00141627 hartree
thermaltrasncorrection: 0.00141627 hartree
thermaltotal: -1869.99883665 hartree
thermalcorr: 0.02890569 hartree
nonthermalcorr: 0.54994722 hartree
totalcorr: 0.57885291 hartree
thermalcorrenthalpy: 0.00094421 hartree
totalenthalpy: -1869.99789244 hartree
totalentropycorr: -0.08350353 hartree
gibbsenthalpy: -1870.08139597 hartree
gibbsminuselec: 0.49629359 hartree
