program: Orca
programVersion: 5.0.2
elementType: N C H N C C O N H C N H H N C H H
charge: 1
multiplicity: 1
keywords: wB97X-D3 TightOpt Freq def2-TZVPP def2/J RIJCOSX TightSCF defgrid3 CHELPG
frequency: 0.00 0.00 0.00 0.00 0.00 0.00 140.30 158.02 193.63 274.40 294.43 349.85 359.13 491.89 493.34 537.58 612.58 639.72 648.06 673.35 675.64 723.63 739.21 760.99 811.03 846.21 903.29 966.58 1041.44 1096.97 1143.66 1159.94 1183.99 1251.91 1345.51 1387.22 1407.06 1476.78 1525.30 1597.93 1608.06 1641.92 1698.55 1702.65 1860.53 3301.67 3626.22 3647.57 3649.81 3659.86 3774.86
frequency: 140.30 158.02 193.63 274.40 294.43 349.85 359.13 491.89 493.34 537.58 612.58 639.72 648.06 673.35 675.64 723.63 739.21 760.99 811.03 846.21 903.29 966.58 1041.44 1096.97 1143.66 1159.94 1183.99 1251.91 1345.51 1387.22 1407.06 1476.78 1525.30 1597.93 1608.06 1641.92 1698.55 1702.65 1860.53 3301.67 3626.22 3647.57 3649.81 3659.86 3774.86
formula: C5H6N5O
InChI: InChI=1S/C5H6N5O/c6-5-9-3-2(4(11)10-5)7-1-8-3/h1,7-8,10H,6H2
17 atoms
N  1.6813 -1.532038 -0.000065
C  2.676374 -0.63914 -0.000055
H  3.727674 -0.873924 -0.000096
N  2.157768 0.572565 0.000022
C  0.783393 0.468684 0.00005
C  -0.255959 1.462888 0.000098
O  -0.14571 2.658095 0.000186
N  -1.506752 0.812645 0.000133
H  -2.296082 1.442406 0.000091
C  -1.715202 -0.542401 0.0001
N  -2.976818 -0.974346 0.000035
H  -3.767267 -0.358017 0.00076
H  -3.135458 -1.965867 0.000325
N  -0.736187 -1.425129 0.000047
C  0.470939 -0.864961 0.000005
H  1.793467 -2.53429 -0.000114
H  2.679801 1.436407 0.000048
totalener: -543.00028403 hartree
nucrepener: 609.41473956 hartree
electener: -1152.41502358 hartree
oneelecener: -1932.27064349 hartree
twoeener: 779.85561990 hartree
kineticenergy: 540.41549383 hartree
xcener: -50.322413180429 hartree
chargesum: 1.0000000
charge: -0.101928 0.185939 0.208173 -0.090559 -0.074809 0.290708 -0.300224 -0.124521 0.163905 0.389093 -0.218904 0.169845 0.202288 -0.375571 0.257670 0.206036 0.212859
charge: 0.431493 -0.009359 0.039352 0.445374 -0.138399 -0.376014 0.139214 0.374964 0.013645 -0.286740 0.401356 -0.013581 0.003646 0.127035 -0.221908 0.030254 0.039668
qa: -0.1019 0.1859 0.2082 -0.0906 -0.0748 0.2907 -0.3002 -0.1245 0.1639 0.3891 -0.2189 0.1698 0.2023 -0.3756 0.2577 0.2060 0.2129
va: 3.5006 3.8950 0.9729 3.5991 3.6892 4.3579 2.2175 3.2799 1.0258 4.2191 3.3080 1.0225 1.0088 3.0212 4.0882 0.9973 0.9918
dispcorr: -0.005063189 hartree
energy: -543.007113679804
dipole: -0.97798 1.96957 0.99159 -2.74868 1.22538 -1.52330 0.00063 -0.00022 0.00041
magnitude: 1.81761 au
magnitude: 4.61999 debye
temp: 298.15 k
press: 1.00 atm
zeropoint: 0.13232116 hartree
thermalvibcorrection: 0.00549130 hartree
thermalrotcorrection: 0.00141627 hartree
thermaltrasncorrection: 0.00141627 hartree
thermaltotal: -542.86646868 hartree
thermalcorr: 0.00832384 hartree
nonthermalcorr: 0.13232116 hartree
totalcorr: 0.14064500 hartree
thermalcorrenthalpy: 0.00094421 hartree
totalenthalpy: -542.86552447 hartree
totalentropycorr: -0.04236110 hartree
gibbsenthalpy: -542.90788557 hartree
gibbsminuselec: 0.09922811 hartree
