program: Orca
programVersion: 5.0.2
elementType: C C C C C C H H H Cl Cl C H N N C N N H H H H H
charge: 1
multiplicity: 1
keywords: wB97X-D3 TightOpt Freq def2-TZVPP def2/J RIJCOSX TightSCF defgrid3 CHELPG
frequency: 0.00 0.00 0.00 0.00 0.00 0.00 25.57 48.45 66.32 76.20 136.52 185.46 193.60 205.78 244.24 289.67 331.51 365.29 419.49 425.44 427.68 462.66 509.37 523.56 547.93 567.85 623.58 676.93 692.42 755.81 807.17 820.14 836.12 873.72 885.33 916.61 962.17 974.67 1052.59 1062.97 1082.50 1115.10 1137.11 1167.25 1195.81 1210.69 1247.98 1266.16 1320.52 1372.22 1383.85 1432.81 1468.27 1499.11 1518.74 1631.57 1638.74 1657.81 1760.84 1820.41 3210.55 3225.69 3241.13 3246.45 3381.37 3571.18 3584.82 3624.63 3667.97
frequency: 25.57 48.45 66.32 76.20 136.52 185.46 193.60 205.78 244.24 289.67 331.51 365.29 419.49 425.44 427.68 462.66 509.37 523.56 547.93 567.85 623.58 676.93 692.42 755.81 807.17 820.14 836.12 873.72 885.33 916.61 962.17 974.67 1052.59 1062.97 1082.50 1115.10 1137.11 1167.25 1195.81 1210.69 1247.98 1266.16 1320.52 1372.22 1383.85 1432.81 1468.27 1499.11 1518.74 1631.57 1638.74 1657.81 1760.84 1820.41 3210.55 3225.69 3241.13 3246.45 3381.37 3571.18 3584.82 3624.63 3667.97
formula: C8H9Cl2N4
InChI: InChI=1S/C8H9Cl2N4/c9-6-2-1-3-7(10)5(6)4-13-14-8(11)12/h1-4,11,13-14H,12H2
23 atoms
C  3.459279 -0.181936 -0.068935
C  2.230928 -0.807464 0.005858
C  1.024188 -0.068726 0.019242
C  1.137592 1.335972 -0.044352
C  2.36371 1.960909 -0.119928
C  3.520016 1.198416 -0.132301
H  4.360233 -0.778233 -0.077918
H  2.409774 3.039598 -0.166789
H  4.482068 1.689781 -0.191188
Cl -0.252842 2.362075 -0.023745
Cl 2.22553 -2.529047 0.078751
C  -0.20546 -0.818593 0.098211
H  -0.112216 -1.895214 0.180041
N  -1.405643 -0.363428 0.070757
N  -2.53413 -1.139667 0.158981
C  -3.770494 -0.45697 -0.035789
N  -4.764989 -0.917123 -0.643785
N  -3.724122 0.816939 0.513562
H  -4.567785 1.329297 0.302132
H  -3.522363 0.838835 1.504103
H  -4.610427 -1.800511 -1.1149
H  -2.448194 -2.031527 -0.305573
H  -1.613727 0.638819 0.025043
totalener: -1449.46047685 hartree
nucrepener: 1050.87982160 hartree
electener: -2500.34029845 hartree
oneelecener: -4057.55012853 hartree
twoeener: 1557.20983008 hartree
kineticenergy: 1445.39834137 hartree
xcener: -93.194846808856 hartree
chargesum: 1.0000000
charge: -0.118006 0.073459 -0.057874 0.019939 -0.097702 -0.062451 0.148625 0.149127 0.163798 -0.005846 0.007329 0.211899 0.117069 0.033665 -0.118478 0.237665 -0.239898 -0.308461 0.188858 0.169661 0.127817 0.154323 0.205482
charge: -0.006680 -0.343965 -0.139212 -0.345463 -0.009830 0.055720 0.039561 0.038864 0.045586 0.525138 0.494189 0.032599 0.026375 0.385880 0.270201 -0.384230 0.168386 0.303241 -0.004889 -0.023139 -0.058493 -0.016380 -0.053458
qa: -0.1180 0.0735 -0.0579 0.0199 -0.0977 -0.0625 0.1486 0.1491 0.1638 -0.0058 0.0073 0.2119 0.1171 0.0337 -0.1185 0.2377 -0.2399 -0.3085 0.1889 0.1697 0.1278 0.1543 0.2055
va: 3.9981 4.0469 3.6599 4.0189 3.9880 3.9775 1.0042 1.0012 0.9905 1.3526 1.3393 3.8779 1.0516 3.5837 3.0807 4.2632 3.1201 3.0858 1.0158 1.0128 1.0377 1.0396 1.0798
dispcorr: -0.008961705 hartree
energy: -1449.471978390789
dipole: -8.17563 8.26006 0.08443 1.21664 -1.33160 -0.11497 0.06807 0.14842 0.21650
magnitude: 0.25926 au
magnitude: 0.65899 debye
temp: 298.15 k
press: 1.00 atm
zeropoint: 0.17467644 hartree
thermalvibcorrection: 0.01045794 hartree
thermalrotcorrection: 0.00141627 hartree
thermaltrasncorrection: 0.00141627 hartree
thermaltotal: -1449.28401147 hartree
thermalcorr: 0.01329048 hartree
nonthermalcorr: 0.17467644 hartree
totalcorr: 0.18796692 hartree
thermalcorrenthalpy: 0.00094421 hartree
totalenthalpy: -1449.28306726 hartree
totalentropycorr: -0.05396370 hartree
gibbsenthalpy: -1449.33703096 hartree
gibbsminuselec: 0.13494743 hartree
