program: Orca
programVersion: 5.0.2
elementType: C H C H H N H H C O H O C H H P C H H H O O H H
charge: 1
multiplicity: 1
keywords: wB97X-D3 TightOpt Freq def2-TZVPP def2/J RIJCOSX TightSCF defgrid3 CHELPG
frequency: 0.00 0.00 0.00 0.00 0.00 0.00 47.67 100.35 109.41 143.51 161.70 182.33 192.51 211.14 266.32 283.70 295.30 319.28 328.07 374.56 414.81 439.43 483.67 549.84 666.18 680.92 745.15 774.07 797.62 852.10 882.75 885.54 927.86 950.15 984.62 1012.60 1022.06 1070.67 1082.24 1110.14 1158.58 1185.84 1219.01 1272.79 1311.39 1351.07 1357.80 1369.09 1396.95 1420.82 1449.49 1453.42 1455.86 1466.76 1496.76 1512.96 1635.38 1676.46 1842.45 2911.47 3055.02 3065.41 3075.50 3085.01 3102.75 3140.85 3155.44 3166.11 3176.87 3512.21 3575.75 3887.94
frequency: 47.67 100.35 109.41 143.51 161.70 182.33 192.51 211.14 266.32 283.70 295.30 319.28 328.07 374.56 414.81 439.43 483.67 549.84 666.18 680.92 745.15 774.07 797.62 852.10 882.75 885.54 927.86 950.15 984.62 1012.60 1022.06 1070.67 1082.24 1110.14 1158.58 1185.84 1219.01 1272.79 1311.39 1351.07 1357.80 1369.09 1396.95 1420.82 1449.49 1453.42 1455.86 1466.76 1496.76 1512.96 1635.38 1676.46 1842.45 2911.47 3055.02 3065.41 3075.50 3085.01 3102.75 3140.85 3155.44 3166.11 3176.87 3512.21 3575.75 3887.94
formula: C5H13NO4P
InChI: InChI=1S/C5H13NO4P/c1-11(9,10)3-2-4(6)5(7)8/h4,7,9H,2-3H2,1,6H3
24 atoms
C  1.467698 0.614877 -0.337911
H  0.956926 0.667357 -1.296773
C  0.618059 1.211505 0.797321
H  1.263793 1.33898 1.670799
H  0.299985 2.210907 0.48828
N  2.754551 1.383684 -0.42205
H  3.084496 1.489149 -1.3786
H  3.421407 0.75388 0.087916
C  1.955173 -0.828564 -0.052345
O  1.151756 -1.803572 -0.309794
H  0.280755 -1.49475 -0.716801
O  3.069241 -0.951994 0.405272
C  -0.598243 0.394512 1.247432
H  -1.134424 0.949293 2.018306
H  -0.286446 -0.545958 1.707926
P  -1.749186 -0.073526 -0.065251
C  -2.646202 1.360364 -0.635928
H  -1.962717 2.081697 -1.083006
H  -3.192381 1.826034 0.183025
H  -3.352537 1.043418 -1.403429
O  -1.026951 -0.770211 -1.168598
O  -2.770665 -0.97186 0.743739
H  2.709356 2.302171 0.011487
H  -3.256902 -1.625086 0.233861
totalener: -895.32890118 hartree
nucrepener: 826.53605560 hartree
electener: -1721.86495678 hartree
oneelecener: -2855.74403212 hartree
twoeener: 1133.87907534 hartree
kineticenergy: 891.87220939 hartree
xcener: -67.850887433522 hartree
chargesum: 1.0000000
charge: -0.083761 0.153147 -0.196818 0.131031 0.121605 0.049146 0.200098 0.223494 0.362425 -0.238327 0.255243 -0.329439 -0.274539 0.137442 0.143894 0.696199 -0.261293 0.101138 0.129040 0.131048 -0.544497 -0.315813 0.188085 0.221454
charge: -0.052630 0.031892 -0.031436 0.039906 0.030481 0.610545 0.053440 0.016672 -0.461249 0.417891 -0.175388 0.149536 -0.113198 0.031999 0.032535 0.468089 -0.088373 0.012423 0.020622 0.026536 -0.161723 0.204940 0.044724 -0.108233
qa: -0.0838 0.1531 -0.1968 0.1310 0.1216 0.0491 0.2001 0.2235 0.3624 -0.2383 0.2552 -0.3294 -0.2745 0.1374 0.1439 0.6962 -0.2613 0.1011 0.1290 0.1310 -0.5445 -0.3158 0.1881 0.2215
va: 3.9358 1.0227 3.8452 1.0052 0.9964 3.6656 0.9959 1.0500 4.2397 2.2802 1.0863 2.1584 3.9010 1.0193 1.0198 5.1167 3.8802 1.0127 1.0059 1.0198 2.0457 2.2427 1.0004 1.0380
dispcorr: -0.010774034 hartree
energy: -895.342662237561
dipole: 0.51497 0.28204 0.79701 10.99220 -7.65884 3.33337 0.56931 -0.93292 -0.36361
magnitude: 3.44656 au
magnitude: 8.76046 debye
temp: 298.15 k
press: 1.00 atm
zeropoint: 0.20114278 hartree
thermalvibcorrection: 0.00984131 hartree
thermalrotcorrection: 0.00141627 hartree
thermaltrasncorrection: 0.00141627 hartree
thermaltotal: -895.12884560 hartree
thermalcorr: 0.01267385 hartree
nonthermalcorr: 0.20114278 hartree
totalcorr: 0.21381664 hartree
thermalcorrenthalpy: 0.00094421 hartree
totalenthalpy: -895.12790139 hartree
totalentropycorr: -0.05132846 hartree
gibbsenthalpy: -895.17922985 hartree
gibbsminuselec: 0.16343238 hartree
