program: Orca
programVersion: 5.0.2
elementType: C C C C C C H H H H C H H H S O O N C N H H O H C C C H H C H C C C H H H H H H H H H N
charge: 1
multiplicity: 1
keywords: wB97X-D3 TightOpt Freq def2-TZVPP def2/J RIJCOSX TightSCF defgrid3 CHELPG
frequency: 0.00 0.00 0.00 0.00 0.00 0.00 14.62 18.84 26.11 31.60 40.63 46.59 99.28 101.37 104.48 125.42 172.96 206.33 213.29 250.76 290.20 295.28 316.59 330.01 343.56 350.72 361.35 394.25 415.24 461.46 483.99 494.76 519.58 540.56 557.61 572.38 610.47 618.48 640.00 649.57 686.78 694.68 701.98 730.47 758.12 775.34 808.43 819.98 833.86 846.29 850.38 873.82 887.11 900.93 919.63 968.00 979.71 1003.88 1010.74 1019.47 1030.19 1038.82 1041.55 1048.70 1057.66 1073.28 1121.51 1130.19 1131.07 1148.74 1157.71 1180.05 1182.15 1189.33 1200.96 1217.76 1227.53 1244.44 1254.88 1271.65 1284.18 1292.13 1303.59 1323.62 1327.36 1339.25 1342.85 1346.40 1347.32 1351.69 1361.49 1390.48 1421.23 1426.24 1437.59 1454.65 1457.09 1480.20 1495.01 1495.99 1498.53 1510.45 1521.54 1526.70 1530.16 1548.82 1640.08 1650.03 1677.00 1732.32 3019.91 3026.31 3040.04 3070.34 3075.31 3075.67 3076.85 3103.04 3125.75 3129.61 3132.50 3140.92 3141.36 3154.44 3166.79 3210.64 3212.73 3228.25 3233.60 3355.48 3536.56 3549.84
frequency: 14.62 18.84 26.11 31.60 40.63 46.59 99.28 101.37 104.48 125.42 172.96 206.33 213.29 250.76 290.20 295.28 316.59 330.01 343.56 350.72 361.35 394.25 415.24 461.46 483.99 494.76 519.58 540.56 557.61 572.38 610.47 618.48 640.00 649.57 686.78 694.68 701.98 730.47 758.12 775.34 808.43 819.98 833.86 846.29 850.38 873.82 887.11 900.93 919.63 968.00 979.71 1003.88 1010.74 1019.47 1030.19 1038.82 1041.55 1048.70 1057.66 1073.28 1121.51 1130.19 1131.07 1148.74 1157.71 1180.05 1182.15 1189.33 1200.96 1217.76 1227.53 1244.44 1254.88 1271.65 1284.18 1292.13 1303.59 1323.62 1327.36 1339.25 1342.85 1346.40 1347.32 1351.69 1361.49 1390.48 1421.23 1426.24 1437.59 1454.65 1457.09 1480.20 1495.01 1495.99 1498.53 1510.45 1521.54 1526.70 1530.16 1548.82 1640.08 1650.03 1677.00 1732.32 3019.91 3026.31 3040.04 3070.34 3075.31 3075.67 3076.85 3103.04 3125.75 3129.61 3132.50 3140.92 3141.36 3154.44 3166.79 3210.64 3212.73 3228.25 3233.60 3355.48 3536.56 3549.84
formula: C15H22N3O3S
InChI: InChI=1S/C15H22N3O3S/c1-11-5-7-14(8-6-11)22(20,21)17-15(19)16-18-9-12-3-2-4-13(12)10-18/h5-8,12-13,16-17,19H,2-4,9-10H2,1H3
44 atoms
C  -4.218644 2.198376 -0.221227
C  -3.705335 1.980171 1.056479
C  -3.02146 0.819668 1.364114
C  -2.846595 -0.136411 0.370237
C  -3.350333 0.05055 -0.913358
C  -4.029858 1.217357 -1.196798
H  -3.851913 2.727543 1.825799
H  -2.64405 0.646622 2.362915
H  -3.23249 -0.712791 -1.67104
H  -4.432577 1.36854 -2.190287
C  -4.992322 3.443939 -0.532824
H  -6.056115 3.275467 -0.352988
H  -4.67972 4.27538 0.096427
H  -4.877699 3.733586 -1.576098
S  -1.976356 -1.588676 0.748904
O  -1.877734 -1.764025 2.147079
O  -2.375067 -2.652427 -0.129587
N  -0.381063 -1.260719 0.235867
C  0.240823 -1.76156 -0.835234
N  1.473554 -1.373534 -1.099578
H  0.189491 -0.619906 0.779816
H  1.937379 -1.782475 -1.90355
O  -0.295082 -2.616987 -1.638192
H  -1.181733 -2.883006 -1.292815
C  3.295583 -0.989661 0.459329
C  2.454913 0.816527 -0.973215
C  4.379284 0.011196 0.113567
H  3.07076 -1.008111 1.527148
H  3.50715 -2.009465 0.137343
C  3.59191 1.296283 -0.100614
H  2.799038 0.625752 -1.996907
C  5.512099 0.463553 1.018938
C  4.677369 2.284455 -0.489135
C  5.850645 1.875196 0.451184
H  5.164389 0.535276 2.051869
H  4.957019 2.148259 -1.536219
H  4.386504 3.325487 -0.361422
H  5.970694 2.593786 1.260373
H  1.582819 1.468419 -1.011414
H  6.371161 -0.204677 1.010124
H  6.792193 1.862733 -0.095261
H  4.805483 -0.268831 -0.857992
H  3.171418 1.598541 0.866373
N  2.101189 -0.453762 -0.281226
totalener: -1372.81541486 hartree
nucrepener: 2011.41105908 hartree
electener: -3384.22647395 hartree
oneelecener: -5849.97896656 hartree
twoeener: 2465.75249262 hartree
kineticenergy: 1366.81098475 hartree
xcener: -112.795001165530 hartree
chargesum: 1.0000000
charge: 0.010264 -0.121854 -0.083335 -0.064915 -0.106204 -0.133155 0.138191 0.156166 0.134365 0.137755 -0.171519 0.118699 0.096416 0.096462 0.841177 -0.374770 -0.437681 -0.193890 0.469053 -0.082139 0.193248 0.181795 -0.240513 0.259063 -0.089801 -0.112785 -0.029260 0.096846 0.108472 -0.018942 0.103067 -0.180955 -0.182717 -0.119365 0.079561 0.080545 0.093057 0.090874 0.099761 0.095593 0.091220 0.074959 0.083005 -0.185815
charge: -0.043533 0.022229 0.002502 -0.266477 -0.004974 0.021850 0.035203 0.033754 0.028237 0.034938 0.041425 0.035454 0.026811 0.026758 0.724407 -0.181872 -0.172038 0.189062 -0.356036 0.312313 -0.025380 0.003710 0.438615 -0.134237 -0.030957 -0.047326 -0.079383 0.021147 0.016234 -0.079256 0.018652 0.004900 0.004589 0.014765 0.021706 0.021794 0.018500 0.017943 0.015907 0.019073 0.018125 0.039857 0.042224 0.148787
qa: 0.0103 -0.1219 -0.0833 -0.0649 -0.1062 -0.1332 0.1382 0.1562 0.1344 0.1378 -0.1715 0.1187 0.0964 0.0965 0.8412 -0.3748 -0.4377 -0.1939 0.4691 -0.0821 0.1932 0.1818 -0.2405 0.2591 -0.0898 -0.1128 -0.0293 0.0968 0.1085 -0.0189 0.1031 -0.1810 -0.1827 -0.1194 0.0796 0.0805 0.0931 0.0909 0.0998 0.0956 0.0912 0.0750 0.0830 -0.1858
va: 3.8141 3.9848 3.9996 3.7885 4.0237 4.0051 1.0042 1.0096 1.0157 1.0043 3.8957 0.9953 1.0049 1.0041 5.8486 2.1486 2.0543 3.2660 4.2596 3.3806 1.0429 1.0180 2.3090 1.0699 3.9053 3.9280 3.8246 1.0105 1.0112 3.7441 1.0091 3.9893 3.9910 3.8496 1.0136 1.0114 1.0171 1.0134 1.0169 1.0161 1.0137 1.0251 1.0244 2.7457
dispcorr: -0.020350937 hartree
energy: -1372.843107312831
dipole: 23.64898 -22.98560 0.66338 20.79874 -19.94027 0.85847 -3.14783 1.93333 -1.21450
magnitude: 1.62851 au
magnitude: 4.13934 debye
temp: 298.15 k
press: 1.00 atm
zeropoint: 0.37370161 hartree
thermalvibcorrection: 0.01773858 hartree
thermalrotcorrection: 0.00141627 hartree
thermaltrasncorrection: 0.00141627 hartree
thermaltotal: -1372.44883458 hartree
thermalcorr: 0.02057112 hartree
nonthermalcorr: 0.37370161 hartree
totalcorr: 0.39427274 hartree
thermalcorrenthalpy: 0.00094421 hartree
totalenthalpy: -1372.44789037 hartree
totalentropycorr: -0.06941171 hartree
gibbsenthalpy: -1372.51730208 hartree
gibbsminuselec: 0.32580524 hartree
