program: Orca
programVersion: 5.0.2
elementType: Cl Cl O O O O O O O C C C C C C C C C C C C C C C C C C H H H H H H H H H H H H H H H
charge: 1
multiplicity: 1
keywords: wB97X-D3 TightOpt Freq def2-TZVPP def2/J RIJCOSX TightSCF defgrid3 CHELPG
frequency: 0.00 0.00 0.00 0.00 0.00 0.00 19.37 27.24 39.18 69.45 71.48 89.74 97.65 109.12 115.80 121.39 148.43 152.60 166.02 170.02 189.20 210.99 211.38 217.32 248.44 256.19 272.19 287.05 310.76 311.26 324.02 337.95 342.83 358.44 367.56 379.13 388.96 396.72 422.66 446.29 481.43 491.02 498.49 508.31 540.58 577.90 609.54 613.18 624.26 659.36 689.92 697.34 726.35 746.10 749.67 773.29 783.64 796.80 809.93 824.11 846.52 867.55 878.34 916.56 950.46 996.00 1015.06 1055.82 1063.72 1065.29 1085.95 1090.13 1107.49 1145.23 1175.43 1177.02 1180.76 1209.52 1226.22 1237.12 1248.14 1252.65 1283.96 1323.77 1341.02 1343.44 1378.37 1405.34 1426.17 1431.37 1438.22 1470.67 1472.20 1481.37 1489.98 1492.26 1497.98 1498.38 1500.51 1501.55 1503.25 1511.22 1530.46 1534.97 1567.77 1624.28 1641.86 1649.55 1662.93 1685.89 1904.00 3077.75 3084.10 3095.48 3101.71 3150.78 3165.34 3169.02 3201.03 3202.21 3205.20 3220.93 3228.99 3263.43 3265.51 3800.65
frequency: 19.37 27.24 39.18 69.45 71.48 89.74 97.65 109.12 115.80 121.39 148.43 152.60 166.02 170.02 189.20 210.99 211.38 217.32 248.44 256.19 272.19 287.05 310.76 311.26 324.02 337.95 342.83 358.44 367.56 379.13 388.96 396.72 422.66 446.29 481.43 491.02 498.49 508.31 540.58 577.90 609.54 613.18 624.26 659.36 689.92 697.34 726.35 746.10 749.67 773.29 783.64 796.80 809.93 824.11 846.52 867.55 878.34 916.56 950.46 996.00 1015.06 1055.82 1063.72 1065.29 1085.95 1090.13 1107.49 1145.23 1175.43 1177.02 1180.76 1209.52 1226.22 1237.12 1248.14 1252.65 1283.96 1323.77 1341.02 1343.44 1378.37 1405.34 1426.17 1431.37 1438.22 1470.67 1472.20 1481.37 1489.98 1492.26 1497.98 1498.38 1500.51 1501.55 1503.25 1511.22 1530.46 1534.97 1567.77 1624.28 1641.86 1649.55 1662.93 1685.89 1904.00 3077.75 3084.10 3095.48 3101.71 3150.78 3165.34 3169.02 3201.03 3202.21 3205.20 3220.93 3228.99 3263.43 3265.51 3800.65
formula: C18H15Cl2O7
InChI: InChI=1S/C18H15Cl2O7/c1-6-11-16(13(20)14(21)12(6)19)27-15-7(2)10(17(22)25-4)8(24-3)5-9(15)26-18(11)23/h5,21-22H,1-4H3
42 atoms
Cl -1.387494 -3.002579 0.583446
Cl -5.370912 -0.126883 -1.489584
O  -0.317116 -0.364073 1.455382
O  -0.137913 2.39321 0.97626
O  4.104672 1.892901 -0.925045
O  -3.851333 -2.526641 -0.807998
O  -2.102681 2.968231 1.7516
O  4.24737 -2.054147 -0.151426
O  5.258479 -0.274952 -0.899844
C  0.790736 0.170337 0.846838
C  1.908052 -0.617494 0.622668
C  -2.082241 0.943177 0.50917
C  0.814226 1.541729 0.579214
C  -1.484712 -0.29473 0.722803
C  3.040499 -0.025284 -0.01071
C  -3.295438 1.045007 -0.186271
C  3.010529 1.361988 -0.328232
C  1.916355 2.131456 -0.023573
C  -1.501209 2.143943 1.152554
C  -2.079783 -1.463949 0.28704
C  1.883806 -2.029896 1.129523
C  -3.867888 -0.138698 -0.631221
C  -3.29454 -1.391222 -0.399092
C  -3.9700 2.355833 -0.463803
C  4.210245 -0.790534 -0.358671
C  4.14598 3.286971 -1.256143
C  5.431996 -2.812327 -0.509543
H  1.882729 3.193152 -0.20925
H  1.85046 -2.745799 0.309132
H  2.770447 -2.242159 1.721798
H  1.007005 -2.181987 1.746203
H  -4.334715 2.380537 -1.48919
H  -4.831408 2.482132 0.193634
H  -3.310495 3.201638 -0.304401
H  4.065648 3.889607 -0.352613
H  3.349313 3.528535 -1.958209
H  5.111889 3.447885 -1.723275
H  5.604939 -2.7334 -1.579389
H  5.197684 -3.831503 -0.226189
H  6.286748 -2.437823 0.047164
H  -4.686535 -2.337693 -1.251011
H  5.110631 0.694966 -1.034901
totalener: -2141.80970092 hartree
nucrepener: 2876.12484064 hartree
electener: -5017.93454155 hartree
oneelecener: -8635.45864159 hartree
twoeener: 3617.52410003 hartree
kineticenergy: 2134.61823411 hartree
xcener: -155.347626867322 hartree
chargesum: 1.0000000
charge: -0.015193 -0.044406 -0.340203 -0.209928 -0.271953 -0.251625 -0.230033 -0.206864 -0.235845 0.195392 0.000690 -0.114843 0.176027 0.330911 -0.095362 0.028036 0.245159 -0.169831 0.330394 -0.118873 -0.274381 -0.037960 0.187182 -0.217340 0.543221 -0.136783 -0.121822 0.136447 0.118579 0.108516 0.120912 0.102563 0.127303 0.086179 0.136073 0.133250 0.124776 0.139311 0.138422 0.140187 0.207803 0.235915
charge: 0.484935 0.473013 0.335532 0.371996 0.359084 0.396999 0.211483 0.385444 0.456717 -0.179236 -0.002602 -0.090195 -0.161055 -0.201198 -0.082218 -0.064047 -0.156496 0.004282 -0.374290 -0.399225 0.034051 -0.375194 -0.250246 0.032697 -0.281143 0.003265 0.037232 0.037025 0.029251 0.025056 0.016565 0.021437 0.038155 0.022298 0.018790 0.018330 0.022558 0.020390 0.024091 0.020325 -0.122817 -0.161039
qa: -0.0152 -0.0444 -0.3402 -0.2099 -0.2720 -0.2516 -0.2300 -0.2069 -0.2358 0.1954 0.0007 -0.1148 0.1760 0.3309 -0.0954 0.0280 0.2452 -0.1698 0.3304 -0.1189 -0.2744 -0.0380 0.1872 -0.2173 0.5432 -0.1368 -0.1218 0.1364 0.1186 0.1085 0.1209 0.1026 0.1273 0.0862 0.1361 0.1332 0.1248 0.1393 0.1384 0.1402 0.2078 0.2359
va: 1.3081 1.3098 2.0775 2.2045 2.1630 2.2672 2.2516 2.2771 2.3189 3.8105 3.8000 3.7168 4.1961 3.6586 3.6410 3.7218 3.9865 3.9487 4.2245 4.1001 3.9173 3.8747 4.0919 3.9275 3.9551 3.8336 3.8110 1.0258 0.9974 1.0088 1.0232 1.0003 0.9968 1.0154 0.9837 0.9839 0.9980 0.9905 0.9921 0.9906 1.0678 1.1003
dispcorr: -0.022388667 hartree
energy: -2141.836359774447
dipole: 33.59334 -28.14024 5.45310 8.52193 -8.37933 0.14260 -4.61527 2.82004 -1.79523
magnitude: 5.74278 au
magnitude: 14.59698 debye
temp: 298.15 k
press: 1.00 atm
zeropoint: 0.31095586 hartree
thermalvibcorrection: 0.02217498 hartree
thermalrotcorrection: 0.00141627 hartree
thermaltrasncorrection: 0.00141627 hartree
thermaltotal: -2141.50039639 hartree
thermalcorr: 0.02500752 hartree
nonthermalcorr: 0.31095586 hartree
totalcorr: 0.33596338 hartree
thermalcorrenthalpy: 0.00094421 hartree
totalenthalpy: -2141.49945218 hartree
totalentropycorr: -0.07748223 hartree
gibbsenthalpy: -2141.57693441 hartree
gibbsminuselec: 0.25942536 hartree
