program: Orca
programVersion: 5.0.2
elementType: C H C H H O P O O O H C O H O H H H
charge: 1
multiplicity: 1
keywords: wB97X-D3 TightOpt Freq def2-TZVPP def2/J RIJCOSX TightSCF defgrid3 CHELPG
frequency: 0.00 0.00 0.00 0.00 0.00 0.00 37.18 63.01 124.49 161.10 188.15 227.46 233.43 280.94 311.80 367.98 401.90 411.65 441.16 461.15 484.10 518.49 558.64 756.85 807.83 828.84 858.89 911.16 927.95 929.59 998.53 1038.83 1108.49 1116.52 1135.53 1143.74 1193.32 1229.98 1277.69 1301.30 1356.73 1403.25 1413.34 1449.56 1506.67 1849.59 3034.27 3054.61 3103.60 3122.41 3178.21 3646.08 3860.66 3866.67
frequency: 37.18 63.01 124.49 161.10 188.15 227.46 233.43 280.94 311.80 367.98 401.90 411.65 441.16 461.15 484.10 518.49 558.64 756.85 807.83 828.84 858.89 911.16 927.95 929.59 998.53 1038.83 1108.49 1116.52 1135.53 1143.74 1193.32 1229.98 1277.69 1301.30 1356.73 1403.25 1413.34 1449.56 1506.67 1849.59 3034.27 3054.61 3103.60 3122.41 3178.21 3646.08 3860.66 3866.67
formula: C3H8O6P
InChI: InChI=1S/C3H8O6P/c4-1-3(5)2-9-10(6,7)8/h1,3,5-8H,2H2
18 atoms
C  1.68933 0.189897 0.554746
H  1.654328 0.270308 1.647831
C  0.736879 1.204884 -0.051681
H  0.712466 1.129633 -1.139332
H  0.99997 2.219396 0.238633
O  -0.604941 1.00497 0.464997
P  -1.629451 -0.031781 -0.034209
O  -1.810743 0.252755 -1.542956
O  -2.980825 0.233983 0.652035
O  -1.196537 -1.472687 0.264289
H  -3.142195 -0.131569 1.527893
C  3.124679 0.452691 0.10987
O  3.71965 -0.410434 -0.467589
H  3.572434 1.429386 0.347551
O  1.34213 -1.115974 0.15963
H  -2.363683 -0.332665 -2.070539
H  2.125559 -1.505151 -0.266587
H  -0.202813 -1.589944 0.235777
totalener: -911.79421444 hartree
nucrepener: 725.97976040 hartree
electener: -1637.77397483 hartree
oneelecener: -2681.44763808 hartree
twoeener: 1043.67366325 hartree
kineticenergy: 908.45895648 hartree
xcener: -66.657587822972 hartree
chargesum: 1.0000000
charge: 0.114433 0.113953 -0.006154 0.144400 0.138375 -0.277643 0.942747 -0.260800 -0.256363 -0.307464 0.249184 0.144235 -0.253884 0.126703 -0.369787 0.246184 0.239893 0.271987
charge: -0.190702 0.042958 -0.054434 0.030165 0.041357 0.159885 0.228039 0.253381 0.264039 0.207776 -0.078956 -0.134677 0.208307 0.023424 0.368069 -0.081100 -0.114786 -0.172743
qa: 0.1144 0.1140 -0.0062 0.1444 0.1384 -0.2776 0.9427 -0.2608 -0.2564 -0.3075 0.2492 0.1442 -0.2539 0.1267 -0.3698 0.2462 0.2399 0.2720
va: 3.8884 1.0012 3.7772 1.0042 1.0032 2.2254 5.6356 2.3247 2.3605 2.2575 1.0141 4.0138 2.1909 0.9990 2.0890 1.0159 1.0468 1.0721
dispcorr: -0.006546677 hartree
energy: -911.804133164785
dipole: 4.77435 -5.66409 -0.88974 1.45864 -1.08183 0.37681 0.53947 -0.25579 0.28368
magnitude: 1.00702 au
magnitude: 2.55964 debye
temp: 298.15 k
press: 1.00 atm
zeropoint: 0.13369049 hartree
thermalvibcorrection: 0.00824637 hartree
thermalrotcorrection: 0.00141627 hartree
thermaltrasncorrection: 0.00141627 hartree
thermaltotal: -911.65936376 hartree
thermalcorr: 0.01107892 hartree
nonthermalcorr: 0.13369049 hartree
totalcorr: 0.14476940 hartree
thermalcorrenthalpy: 0.00094421 hartree
totalenthalpy: -911.65841955 hartree
totalentropycorr: -0.04812663 hartree
gibbsenthalpy: -911.70654618 hartree
gibbsminuselec: 0.09758698 hartree
